�ԍ�,���ԍ�,�������N����,���Ǖی���,���ƎҖ���,��\�Ҏ���,�Z���i�s���{���j,�Z���i�s�����j,�Z���i���E�Ԓn�E���������j,�d�b�ԍ�,�ϑ֕ۊǂ̗L��,�R���k,���D,�p��,�p�_,�p�A���J��,�p�v���X�`�b�N��,������,�؂���,�@�ۂ���,���A�����c��,�����n�Ō`�s�v��,�S������,��������,�����퓙,�z����,���ꂫ��,�����̂ӂ�A,�����̎���,�΂�����,��P�R��,�����ԓ��j�ӕ�,�ΖȊܗL
1,1811056345,H30.12.16,����,�i���j�A�[�X�E�R�[�|���[�V����,�����@�T��,�x�R��,�x�R�s,����4-3-9,076-445-5500,�L,,,,,,,,,,,,,,,,,,,��,,,
2,1808169485,H29.11.20,�ዷ,�A�[�X�G�R�i���j,�����@��,���䌧,��ьS��������,�{��156-7-21,0770-77-2680,��,,��,��,,,��,��,��,��,,,��,��,��,,��,,,,,,
3,1801038823,H34.2.14,����,�i���j�A�[�X�N���[���Q�P,���c�@�`�v,�x�R��,�ː��s,���ˌ�905-3,0766-84-6648,��,,��,,,,��,,��,��,,,��,��,��,,��,,,,,,��
4,1808184679,H32.9.23,�ዷ,�A�[�X�e�N�m�i���j,�O�H�@����,���s�{,�����s,���ޗǖ��z32-1,075-981-1400,��,,��,��,��,��,��,��,��,,��,,,��,��,,,,,,,,
5,1801191209,H33.9.29,����,�i���jEARTH�@TECH,�O��@���I,���䌧,����s,������3����1103�Ԓn,0776-21-3022,��,,,,,,��,��,��,��,,,��,��,��,,��,,,,,,��
6,1802176681,H31.3.13,���,�i���j�A�[�c,��c�@�ƒj,���䌧,���s,�t�]���Β�27-18,0776-51-8448,��,,��,,,,��,��,��,��,,,,��,��,,��,,,,,,
7,1802036143,H32.12.18,���,�i���j�A�[�c�E�`�E�j,�R�{�@�`��,���䌧,���s,�t�]���Β�27-18,0776-51-9166,��,,��,,,,��,��,��,��,,,,��,��,,��,,,,,,
8,1807099004,H30.6.2,��B,�i�L�j�A�[�g�e�N�j�J���Z���^�[,�ҒJ�@�O,���{,�x�c�юs,������2-4-3,0721-28-1880,��,,,,,,��,,,,,,,��,��,,,,,,,,
9,1807085811,H31.10.25,��B,�i�L�j�A�[���E�G�[,�����@�M�q,�O�d��,�����s,�������䐼��Ԓ�3,0595-68-7105,��,��,��,,,,��,��,��,��,��,,,��,��,,��,,,��,,,��
10,1803001047,H32.11.15,���z,�i���j�A�[���e�b�N,�F�J�@�b��,��ʌ�,���Ԏs,�厚��{��349-1,04-2936-2306 ,��,,,,,,��,��,��,��,,,,��,��,,��,,,,,,
11,1802029554,H32.4.2,���,�i�L�j�A�C�E�G�b�`�E�G�X�E�Z���^�[,����@�r�K,�ΐ쌧,����s,������1-435,076-296-8280,��,,��,��,,,��,,,,,,,,,,,,,,,,
12,1807153253,H32.11.7,��B,�i���j�h�]�j��������,�ʒu�@�a��,�ޗǌ�,�ޗǎs,�����47-1,0742-62-2001,��,��,��,,,,��,��,��,��,,,��,��,��,��,��,,,��,,,��
13,1801059801,H32.3.6,����,�i�L�j���T�[�r�X,�ߓ��@���a,���䌧,����s,���{3-2-4,0776-25-3055,��,,,,,,��,��,��,��,,,��,��,��,,��,,,,,,
14,1802004128,H32.4.24,���,�i���j�A�C�U�b�N,�����@�R��,�x�R��,���Îs,�厚��C���쑺1181,0765-24-6000,��,,��,��,��,��,��,,,,,,,��,��,,,,,,,,��
15,1805000485,H35.3.23,�O��,�i���j�A�C�U�b�N�E�g�����X�|�[�g,���q�@�M�v,�x�R��,�x�R�s,�ēc��1-6-30,076-437-5520,��,��,��,��,��,��,��,��,��,��,,,��,��,��,��,��,,,��,,,��
16,1811158386,H33.3.22,����,�i���j�A�C�V�[����,�g��@�_�j,���䌧,����s,���O��18-12,0776-53-3757,�L,,,,,,��,,,,,,��,��,��,,,,,,,,
17,1802173284,H33.12.4,���,�i�L�j���M���ݍH��,�V��@�z�O,���m��,�Ó��s,��꒬8-156-1,0567-25-1933,��,,,,,,��,,��,,,,,��,��,,��,,,,,,
18,1801004256,H31.8.8,����,���c���w�H�Ɓi���j,���c�@����,�����s,�{���s,�쒬6-15-13,042-368-6311,��,,��,��,��,��,��,,,,,,,��,��,,,,,,,,
19,1801156910,H32.10.21,����,�i�L�j�A�C�E�e�b�N,���ь��@����,���䌧,����s,���a1-2512,0776-33-0133,��,,,,,,��,,,,,,,��,��,,��,,,,,,
20,1805005522,H30.9.27,�O��,�i���j�A�C�f�b�N�X,��o�@��,���{,���Ύs,�ÔV�]��2-22-9,072-650-1988,��,,��,��,��,��,��,,,,,,,��,��,,,,,,,,��
21,1801124157,H32.12.8,����,�i���j�A�C�r�b�N�X,�g�c�@�q�v,���䌧,����s,���n2-101,0776-33-6388,��,,,,,,��,,,,,,,��,,,,,,,,,
22,1808151250,H32.9.30,�ዷ,�i�L�j�A�C��,���J�@�Ђ��,���Ɍ�,���Ð�s,���Ð쒬�k�݉�372-6,079-423-2500,��,��,��,��,��,��,��,��,��,��,��,,��,��,��,��,��,,,��,,,��
23,1807000617,H34.6.24,��B,�i���j�A�C�����h,�R���@�D��,���ꌧ,�Γ�s,�Ε��k5-7-7,0748-77-8566,��,,��,,,,��,��,��,,,,,��,��,,��,,,,,,��
24,1802185768,H32.10.18,���,�i�L�j�A�C�������e�i���X,���V�@�G�M,���䌧,���s,�ۉ�����c29-13,0776-67-5553,��,,,,,,��,��,��,��,,,��,��,��,,��,,,,,,
25,1808181146,H31.12.18,�ዷ,�i���j�A�E�g�s�A�[,���X�@�r�O,���䌧,���l�s,���~3-401-1,0770-56-1536,��,,,,,,��,��,��,��,,,,��,��,,��,,,,,,
26,1807002476,H30.8.30,��B,���������i���j,���R�@�q��,���s�{,���s�s�E����,���㒹���{�k�㒬11,075-861-9546,��,,��,,,,��,,,,��,,,��,��,,,,,��,,,
27,1801110334,H31.9.11,����,�i���j�ؓy��,�؁@��,���䌧,�g�c�S�i������,���Îs12-16,0776-63-2161,��,,��,,,,,,,,,,,��,��,,��,,,,,,
28,1801061955,H33.6.20,����,�i���j�R,�R�@�m�O,���s�{,���s�s������,�����H��������100,075-621-3560,��,,��,��,,,��,��,��,��,,,��,��,��,,��,,,,,,
29,1802186257,H32.12.1,���,�Ԕ����݁i�L�j,�ؓc�@�N�v,���䌧,�����s,�k��140-1-1,0776-79-0818,��,,,,,,��,,��,,,,,��,��,,��,,,,,,
30,1801033409,H31.9.11,����,�i�L�j�ԍꐴ�|,�����@���I,���挧,�����S�ՉY��,�ԍ�1986-2,0858-49-2033,��,��,��,��,,,��,��,��,��,��,,,��,��,��,��,,,��,,,��
31,1807021570,H31.7.22,��B,�i�L�j���Ί��J��,��؁@�q�j,���Ɍ�,���Ύs,��v�ے�����606-2,078-938-1007,��,��,��,��,��,��,��,��,��,��,��,,��,��,��,,��,,,,,,��
32,1801016159,H33.3.21,����,�H�c�^�A�i���j,�����@��,���m��,��{�s,��쎚������8,0586-76-9911,��,,,,,,��,,,,,,,��,��,,,,,,,,
33,1801021090,H32.1.17,����,�H�c�@�p�v,�H�c�@�p�v,���䌧,�g�c�S�i������,����������2-303,0776-61-1936,��,,,,,,��,��,��,,,,,,,,��,,,,,,
34,1807150246,H32.7.26,��B,���I�}�l�W�����g�i���j,��t�@�I�N,���䌧,�։�s,���a��1-3-2,0770-21-7700,��,,,,,,��,��,��,��,,,��,��,��,,��,,,,,,
35,1813169940,H30.1.23,���z,�i�L�j�����d��,����@�_��,���䌧,���s,������2-901,0779-66-5556,�L,,,,,,��,,��,,,,,��,��,,��,,,,,,
36,1808032928,H29.8.1,�ዷ,�i���j�A�N�A,�r�c�@���,���s�{,���ߎs,���ɍ���100,0773-75-2185,��,,��,,,,��,,,,,,,��,��,,��,,,,,,
37,1808174855,H30.11.14,�ዷ,�i���j�A�N�A�e�b�N,�M�c�@����,���䌧,���l�s,����33-2,0770-64-5460,��,,��,��,,,,,,,,,,,,,,,,,,,
38,1801177820,H31.9.4,����,�i���j�A�N�V�[,�~�{�@����,���Ɍ�,�����s,��R3-5-5,0729-99-7313,��,��,��,��,��,��,��,��,��,��,��,,��,��,��,��,��,��,��,��,,,��
39,1807030811,H31.3.13,��B,�i���j�A�N�X,�R���@�s�Y,���ꌧ,��Îs,�}4-746-5,0775-46-7806,��,,��,,,,,,,,,,,,,,,,,,,,
40,1801061092,H31.9.30,����,�A�N�e�B���}�g�i���j,�_���@����,���{,��^�s,�e�c��19-7,06-6780-7221,��,,��,��,,,,,,,,,,,,,,,,,,,
41,1801111021,H31.5.6,����,�i�L�j�`�����D��������,����@�\��,���䌧,����s,��{4-7-1,0776-26-1217,��,,��,,,,��,��,��,,,,��,��,��,,��,,,,,,
42,1801040615,H33.6.10,����,���@���K,���@���K,���䌧,����s,�Ǝ�3-6-3,0776-23-3894,��,,,,,,��,��,��,,,,��,��,��,,,,,,,,
43,1801162195,H31.12.16,����,�i���j�����^�A,�����@�W,�ΐ쌧,���R�s,������1-131,076-278-2701,��,,,,,,��,��,��,��,,,��,��,��,,��,,,,,,
44,1801085293,H29.6.10,����,�i�L�j��싻��,���@�G��,���䌧,����s,�]�㒬45-9,0776-59-1133,��,,,,,,,,��,,,,,,,,��,,,,,,
45,1807017848,H33.11.19,��B,���������i���j,�K���@�R�s,���m��,���É��s�k��,�Z���r��555,052-901-2111,��,,,,,,��,��,��,��,,,,��,��,,��,,,,,,��
46,1801150092,H31.7.29,����,�A�T�q�e�N�m�t�H�[�g�i���j,�x�c�@�N�O,���䌧,����s,��{6-5-12,0776-24-2312,��,,,,,,��,��,��,,,,��,��,��,,��,,,,,,
47,1801000503,H34.10.5,����,�A�T�q�v���e�b�N�i���j,���Y�@�m��,���Ɍ�,�_�ˎs,����招��l��21,078-333-5600,��,,��,��,��,��,��,,,,,,,��,��,,,,,,,,
48,1807181087,H32.1.19,��B,�i�L�j�A�T�q���C��,���R�@�~��,���䌧,�։�s,�B��164-16-2,0770-21-5610,��,,,,,,��,,,,,,,��,��,,,,,,,,
49,1801172799,H30.8.6,����,�i�L�j�A�T��,���]�@�m��,�ΐ쌧,����s,�ԓy���73-1,076-213-8115,��,,��,,,,��,��,��,��,,,��,��,��,,��,,,,,,��
50,1807108335,H32.3.24,��B,�A�W�A�p�V�t�B�b�N�}�����i���j,���R�@�[��,������,�k��B�s���q�k��,���2-14-1,093-513-8626,��,,,,,,,,,,,,,,,,,,,��,,,
51,1808107558,H30.11.12,�ዷ,�i���j�A�V����,�r�c�@���F,���䌧,���l�s,�؍�31����7-4,0770-56-1556,��,,,,,,,,��,,,,,,,,��,,,,,,
52,1807002192,H30.3.13,��B,�i���j���������ۑS,���q�@�O��,���쌧,���{�s,�g�c2019,0263-92-3225,��,,��,��,,,��,��,��,��,��,,��,��,��,,��,,,,,,��
53,1803059895,H31.3.18,���z,�i���j�A�X�e�C�I��,�����@����,���䌧,���s,����̉�12-41-2,0779-65-8200,��,,��,,,,��,��,��,��,,,,��,��,,��,,,,,,
54,1807004585,H32.3.30,��B,���C�^�i���j,�ǒJ�@�חY,�����s,������,���C1-8-12,03-6221-2238,��,��,,,,,,,,,,,,,,,,,,��,,,
55,1808104979,H32.2.4,�ዷ,���d�C�H���i���j,�]���@��d,���s�{,���ߎs,�����z65-23,0773-76-7656,��,,,,,,��,��,��,��,,,,��,��,,��,,,,,,��
56,1801018371,H31.4.9,����,���H���w�H�Ɓi���j,�с@�L��,���䌧,����s,������51-35,0776-41-2194,��,,,,,,��,,,,,,,,,,,,,,,,
57,1801174949,H30.11.28,����,�i���j���H����,�V�J�@�ÐL,���䌧,����s,����2-22-15,0776-27-1237,��,,��,,,,��,��,��,��,,,,��,��,,��,,,,,,
58,1808046742,H31.12.21,�ዷ,�i���j��������,�����@�[�i,���s�{,���m�R�s,�����83,0773-22-2777,��,,,,,,��,��,��,��,,,,��,��,,��,,,,,,
59,1807057846,H29.5.14,��B,���ό��݁i���j,���ρ@�P�`,���{,�����s,�c��4-59-8,072-848-0460,��,,,,,,,,,,,,,��,,,��,,,,,,
60,1807002148,H32.2.25,��B,�i���j�A���j�e�B,���s�@����,�ΐ쌧,��F�s,��˒��������51,0768-82-2115,��,,��,,,,,,,,,,,,,,,,,,,,
61,1805114990,H31.12.1,����,�V��@�����Y,�V��@�����Y,���䌧,����s,�u�Â��u4-161,0776-53-8671,��,,,,,,��,��,��,��,,,,��,��,,��,,,,,,
62,1808181147,H32.1.19,�ዷ,�i���j�r��,�r�؁@�a�V,���䌧,��ьS��������,�{��146-37,0770-77-0010,��,,,,,,��,��,��,��,,,��,��,��,,��,,,,,,
63,1805071935,H32.8.27,�O��,�i�L�j�A��������,�����@�قÂ�,���䌧,�I�]�s,������5-20-1,0778-51-3787,��,,,,,,,,,,,,,,��,,��,,,,,,��
64,1801192818,H33.12.19,����,�L��@���u,�L��@���u,���䌧,����s,��1����,0776-33-1130,��,,,,,,��,,,,,,,��,��,,��,,,,,,
65,1802045248,H33.7.26,���,�i���j�A���N�X,����@��,���m��,����s,��쒬���L�c10-1,0564-32-4101,��,,��,��,,��,,,,,,,,,,,,,,,,,
66,1801167970,H29.8.27,����,�i���j�A���X,���@�R���q,���䌧,����s,�ԎR��3�����c58,0776-52-2011,��,,��,,,,,,,,,,,,,,,,,,,,
67,1802009822,H35.9.5,���,�i���j�A���g,�≺�@���`,�x�R��,�x�R�s,�����s�c��280,076-478-5388,��,,��,,,,��,��,��,��,,,,��,��,,��,,,,,,��
68,1818054309,H32.5.24,�ዷ,�i�L�j�A���~�b�N����,�����@���i,���Ɍ�,���e�s,���150-1,0795-23-8853,�L,��,��,��,,��,��,��,��,��,��,,��,��,��,,��,,,,,,��
69,1802003515,H33.10.5,���,�i���j�C�[�W�[�G�X,����@����,���Q��,�V���l�s,�V�c��3-1-39,0897-37-1098,��,��,��,��,��,��,��,��,��,��,��,,��,��,��,��,��,,,��,,,��
70,1803149267,H33.8.30,���z,�i���jETS�W���p��,����@��O,�x�R��,�X���s,�\��247�Ԓn5,0766-74-5445,��,,,,,,,,,,,,,,,,,,,��,,,
71,1803084392,H29.5.7,���z,������݁i���j,����@���v,���䌧,���s,�g6-10-1,0779-66-3196,��,,,,,,��,,��,,,,,��,��,,��,,,,,,��
72,1807074846,H33.2.5,��B,�i���j�C�J�^����,�ҁ@���m,���䌧,�։�s,�Óc��68-1517,0770-23-1645,��,,,,,,��,,��,,,,��,��,��,,��,,,,,,
73,1808013558,H33.12.17,�ዷ,��؏����i���j,��؁@�G��,���s�{,���ߎs,�厚���q�������c190,0773-62-1259,��,,,,,,��,,��,,,,,��,��,,��,,,,,,��
74,1811006210,H30.7.25,����,�r�c�����i���j,�r�c�@���T,���䌧,����s,����7-23-26,0776-21-3131,�L,,,,,,��,,��,,,,,��,��,,��,,,,,,
75,1801074844,H33.2.7,����,�i�L�j�ɍ⌚��,�ɍ�@����,���䌧,����s,����31-1-9,0776-36-5431,��,��,��,,,,��,��,��,��,,,��,��,��,,��,,,,,,��
76,1807181394,H31.12.25,��B,�i���j�C�T��,�ҁ@�@��,���䌧,�։�s,�؍�79-17-1,0770-21-5136,��,,,,,,��,��,��,��,,,��,��,��,,��,,,,,,��
77,1805163991,H34.2.19,�O��,�ΐ��Ôp�����i���j,�c���@����,�ΐ쌧,����s,���㒬161-1,0761-77-2235,��,,,,,,��,,,,,,,��,��,,,,,,,,
78,1802063196,H32.3.31,���,�C�V�J�������i���j,�_�J�@��,�򕌌�,����s,��c�V�c4171-1,058-326-5162,��,,,,,,��,��,��,��,,,��,��,��,,��,,,,,,��
79,1801192313,H33.11.29,����,�ΐ쌚�ݍH�Ɓi���j,���c�@�΍s,�ΐ쌧,����s,�j���85,076-268-0281,��,,,,,,��,��,��,��,,,��,��,��,,��,,,,,,
80,1802033573,H34.2.14,���,�i���j�ΐ�H���X,�ΐ�@���v,���䌧,�����s,�s�P5-19-12,0776-73-2248,��,,��,,,,��,��,��,��,,,��,��,��,,��,,,,,,
81,1805046623,H34.3.26,�O��,�΍��Ӑ΁i���j,�q��@�W,���䌧,�I�]�s,���쒬174-10-1,0778-53-0035,��,,,,,,��,,,,,,��,��,��,,��,,,,,,
82,1802059802,H31.3.9,���,�΍苻�Y�i���j,�΍�@�N��,���䌧,���s,�ۉ������50-7,0776-67-7761,��,��,��,��,��,��,��,��,��,��,��,,��,��,��,,��,,,��,,,
83,1808001406,H32.11.4,�ዷ,�i�L�j�����Y��,�����@�{,���s�{,���s�s���,������F��Ӓ�3,075-691-3951,��,,��,��,,��,,,,,,,,,,,,,,,,,
84,1805075319,H32.6.5,�O��,�Γc�^���i���j,�Γc�@�K�_,���{,�ݘa�c�s,�^��9-51,072-422-6160,��,,,,,,��,,,,,,,,,,,,,,,,
85,1807030443,H31.11.24,��B,�i���j�Γc�Y��,�؉��@��,���ꌧ,�F���s,���{��702-4,0749-24-3386,��,��,��,��,��,��,��,��,��,��,��,,��,��,��,��,��,,,,,��,��
86,1803158778,H33.3.6,���z,�i�L�j�Γc�Y��,�Γc�@�d��,���䌧,���s,������5-22,0779-66-2285,��,,,,,,��,��,��,,,,,��,��,,��,,,,,,
87,1801175206,H31.1.26,����,�ΒÁ@����,�ΒÁ@����,�É���,�l���s�l�k��,�l��n9-168,053-545-5513,��,��,��,��,,,��,��,��,��,,,��,��,��,,��,,,,,,��
88,1801190736,H33.8.24,����,�i���j�Γ�,����@�a�F,���䌧,����s,�󐅒�137�����14,0776-38-5858,��,,��,,,,��,��,��,��,,,,��,��,,��,,,,,,
89,1802008772,H36.3.6,���,�i���j�΋�,�΋��@����,�x�R��,�x�R�s,�����Ð�6,076-435-1145,��,,,,,,��,��,��,��,,,��,��,��,,��,,,,,,
90,1808106596,H30.9.25,�ዷ,�΋��H�Ɓi���j,���K�@����,���䌧,��ьS���l��,���O��11-34,0770-72-2814,��,,,,,,��,,��,,,,,��,��,,��,,,,,,
91,1801098595,H29.9.24,����,�Α����݁i���j,�Α��@��v,���䌧,����s,�v�Β�26-25,0776-90-3036,��,,,,,,��,��,��,,,,,��,��,,��,,,,,,
92,1801031367,H29.12.26,����,�C�V���g�������J���i���j,�Ζ{�@��,�x�R��,�x�R�s,�c����1-8-2,076-432-5561,��,,��,��,,,��,��,��,��,,,,��,��,,��,,,,,,��
93,1811160903,H33.7.5,����,�ΎR������́i���j,�ΎR�@��,���䌧,����s,���J��3-610,0776-53-0905,�L,,,,,,��,,,,,,,��,��,,,,,,,,
94,1807075617,H33.8.9,��B,��D�D�i���j,�ʉz�@���F,�����s,������,�z�n3-9-9,03-3547-5311,��,��,,,,,,,,,,,,,,,,,,��,,,
95,1803168437,H29.11.19,���z,�i���j�򌚐�,�����@�`�F,���䌧,���s,��65-98-2,0779-66-1108,��,,,,,,��,,��,,,,,��,,,��,,,,,,
96,1807000299,H31.2.7,��B,�򋻋Ɓi���j,�򌴁@�ۓ�,���Ɍ�,���s,��������1-15-20,06-6488-5005,��,��,��,��,��,��,��,��,��,��,��,,��,��,��,��,��,,,��,,,��
97,1802126984,H33.6.14,���,�C�Y�~�Y�Ɓi���j,�O�H�@�_�l,�x�R��,�����s,���쒬5-46-6,0766-25-7265,��,,,,,,��,��,��,,,,,��,��,,��,,,,,,
98,1808100108,H30.4.30,�ዷ,�����Ɓi���j,���@�ǈ�,���s�{,�����s,�㐙����2,0773-44-0229,��,,,,,,��,��,��,��,,,,��,��,,��,,,,,,��
99,1812163879,H33.12.14,���,��L�d�C�H���i���j,�k�o�@�W��,���䌧,�����s,����32-19,0776-74-1564,�L,,,,,,��,,��,,,,,��,��,,��,,,,,,
100,1805125485,H33.2.19,�O��,�i���j�q�ݔ�,���V�@���T,���䌧,�z�O�s,����1-8-35,0778-22-3980,��,,,,,,��,,��,,,,,��,,,��,,,,,,
101,1801180853,H31.12.7,����,�i�L�j��H��,��@�d��,���䌧,����s,�ێR2-903-1,0776-63-5899,��,,,,,,��,��,��,��,,,,��,��,,��,,,,,,
102,1803047894,H29.5.7,���z,�i���j�s���g,�s���@�T,���䌧,�g�c�S�i������,�R��5-40,0776-64-2288,��,,,,,,,,,,,,,��,,,��,,,,,,
103,1801039480,H30.2.19,����,�i�L�j�s�상���e�i���X�H��,�s��@�P,�O�d��,�O�d�S�Ԗ쒬,�厚��k888,059-393-3005,��,,��,��,��,��,��,��,��,��,,,,��,��,��,��,,,,,,
104,1815060309,H31.4.6,�O��,��@���q,��@���q,���䌧,���s,�O�����V��16-19,0776-81-2156,�L,,,,,,��,,,,,,��,��,��,,,,,,,,
105,1808001209,H33.2.25,�ዷ,��{�^�A�i���j,��{�@�v�O,���Q��,�V���l�s,������2-4-36,0897-33-0138,��,,��,��,,��,��,,,,,,,��,,,,,,,,,
106,1807189010,H33.9.28,��B,�i���j�C�b�V��,�É�@�T�q,���ꌧ,��R�s,��咬344-1,077-583-9811,��,,��,��,��,��,��,,,,,,,��,,,,,,,,,
107,1801190849,H33.9.6,����,�i�L�j�C�b�Z�C�z�[��,�ɐ��J�@�ÍL,���䌧,����s,���J��1����305-4,0776-52-0822,��,,,,,,��,��,��,,,,,��,��,,��,,,,,,
108,1807037457,H33.10.31,��B,�C�c���i���j,���c�@�`�W,��t��,��t�s��ы�,�Z����210,043-423-3415,��,,,,,,��,,��,,,,,��,��,,��,,,,,,
109,1802060069,H31.3.29,���,�ɓ��@�z,�ɓ��@�z,���䌧,���s,�O���������s24-55,0776-82-0858,��,,,,,,��,,,,,,,��,��,,,,,,,,
110,1801086008,H29.7.4,����,�ɓ��H�Ɓi���j,�ɓ��@�`��,���䌧,����s,���1-7-20,0776-36-7466,��,,,,,,��,��,��,��,,,,��,��,,��,,,,,,
111,1802098081,H29.9.4,���,�i���j�ɓ��H���X,�ɓ��@�_��,���䌧,���s,��䒬���V��1-30,0776-66-2269,��,,��,,,,��,��,��,��,,,,��,��,,��,,,,,,��
112,1808006830,H30.3.26,�ዷ,�i�L�j�ɓ����X,�ɓ��@���Y,���ꌧ,��Îs,����Y20-11,077-543-7172,��,,��,��,,,��,��,��,��,,,��,��,��,,��,,,,,,��
113,1807069818,H30.8.27,��B,�i���j�C�g�[�}�s,�����@�P�[,���m��,���ˎs,���h��7-11,0561-84-1100,��,,,,,,��,,��,,,,,,,,,,,,,,
114,1801081446,H33.12.2,����,��_���݁i�L�j,��_�@�F��,���䌧,�g�c�S�i������,�����Ō�3-23,0776-61-1148,��,,,,,,��,��,��,��,,,,��,��,,��,,,,,,��
115,1802098053,H29.8.20,���,�i���j���V�g,���V�@�L,���䌧,���s,��䒬�V��2-302,0776-66-5319,��,,��,,,,��,��,��,��,,,,��,��,,��,,,,,,��
116,1807167803,H29.8.9,��B,�i�L�j�C�i�o�G���^�[�v���C�Y,��t�@����,���䌧,�։�s,�؍�6-16-12,0770-24-2060,��,��,��,,,,��,��,��,��,,,,��,��,,��,,,��,,,
117,1805074845,H33.1.29,�O��,�i�L�j��㏤�X,���@��G,���䌧,�z�O�s,���a��7-19,0778-22-0402,��,,,,,,��,��,��,��,,,��,��,��,,��,,,,,,
118,1807100528,H29.12.19,��B,�Ɍ����݁i���j,�Ɍ��@�_�a,���䌧,�։�s,䴐���88-2,0770-22-2009,��,,,,,,,,��,,,,,,,,��,,,,,,
119,1807000867,H31.9.10,��B,�C�r�f���Y�Ɓi���j,�����@���M,�򕌌�,��_�s,����1-197,0584-89-0777,��,,��,,��,��,��,,,,,,,��,,,,,,,,,
120,1807062254,H32.6.19,��B,�ɐ����^�i���j,�g�c�@���i,���ꌧ,�Č��s,����1749,0749-57-1151,��,��,,,,,,,,,,,,,,,,,,��,,,
121,1807021745,H30.10.9,��B,�i���j�C�{�L��,�����@����,���Ɍ�,���̎s,�K�ې쒬����379,0791-72-3531,��,��,��,��,��,��,��,��,��,��,��,,��,��,��,��,��,,,��,,,��
122,1801079326,H33.8.19,����,����@�p��,����@�p��,���䌧,����s,���蒬23-8,0776-87-2124,��,,,,,,,,,,,,,��,,,��,,,,,,
123,1811065674,H31.11.21,����,�����y�؁i���j,�����@�G�K,���䌧,����s,���J��16-15-2,0776-41-3340,�L,,,,,,��,��,��,��,,,��,��,��,,��,,,,,,
124,1801115929,H33.4.11,����,�ː��^�A�i���j,�Ė�@���G,�x�R��,�ː��s,�z�ڑ�336-8,0766-53-1021,��,,��,,,,��,��,��,��,,,��,��,��,,��,,,,,,
125,1801161134,H33.7.25,����,�i���j���H���H,���H�@�N�V,���䌧,����s,���J��1-1903,0776-53-7909,��,��,��,,,,��,��,��,,,,,��,��,,��,,,,,,��
126,1801137729,H29.9.11,����,�i���j�⍲�y��,�⍲�@���Y,���䌧,����s,�Ȑ�11-10,0776-41-1180,��,,,,,,��,��,��,��,,,,��,��,,��,,,,,,
127,1801022922,H31.8.30,����,�i���j�C���^,��c�@���Y,���䌧,����s,���ؒ���2-1803,0776-33-0578,��,,��,,,,��,��,��,��,,,��,��,��,,��,,,,,,
128,1801084370,H29.12.26,����,�C���^�j�E�G�R�E���W�i���j,�����@�@��,���ꌧ,�Γ�s,���327-14,0748-74-0323,��,,��,��,��,��,��,,,,,,,��,,,,,,,,,
129,1807156313,H33.9.28,��B,�C���b�N�X�Y�Ɓi���j,��{�@����,���s�{,���s�s������,�����͌��c��19-1,075-622-0003,��,,��,��,,,��,��,��,��,,,��,��,��,,��,,,,,,��
130,1807052152,H29.7.10,��B,����ނ�i���j,�⑺�@���b,���ꌧ,�Č��s,���Ȓ}��435-29,0749-52-1379,��,��,��,��,��,��,��,��,��,��,��,,,��,��,��,��,,,��,,,��
131,1801038876,H31.2.4,����,�ܖ{�����i���j,�ܖ{�@��,���s�{,���s�s,���㒹�H�g����4,075-661-1631,��,,,,,,��,��,��,,,,��,��,��,,��,,,,,,
132,1801143593,H30.7.13,����,�i���j��{�g,��{�@����,���䌧,����s,���ؓc1-12-11,0776-36-5005,��,,��,��,,,��,��,��,��,,,��,��,��,,��,,,,,,��
133,1805009408,H33.9.14,�O��,�i���j���@�C�I�X,�g���@�p��,�a�̎R��,�a�̎R�s,����295-9,073-452-9356,��,,��,,,,,,,,,,,,,,,,,,,,
134,1801099684,H29.12.9,����,VEEma�i���j,��؁@�a�j,���䌧,����s,�吣��23-107,0776-35-5555,��,,��,��,��,��,��,��,��,��,��,,��,��,,,,,,,,,
135,1801000835,H31.4.8,����,�i���j�E�G�C�X�g�k��,�{�c�@��T,�ΐ쌧,����s,�Õ{3-160,076-240-6678,��,��,,,,,��,��,��,��,,,��,��,��,,��,,,��,,,��
136,1801192305,H33.11.29,����,�i���j��؋O��,��؁@�쑥,���䌧,����s,�~�쒬26-58,0776-38-3066,��,,,,,,��,��,,��,,,��,��,��,,��,,,,,,
137,1812056102,H30.9.29,���,�i�L�j�㏤,��c�@����,���䌧,���s,�ۉ�������30-28,0776-66-5142,�L,��,��,��,,,��,��,��,��,,,��,��,��,,��,,,,,,��
138,1807000296,H32.7.4,��B,�i���j�E�G�X�M,�㐙�@����,�O�d��,�l���s�s,�V��{��V��1-32,059-365-6800,��,,,,��,��,,,,,,,,,,,,,,,,,
139,1801069118,H32.4.18,����,��c�^�A�i���j,��c�@�^,�ΐ쌧,�����s,�H�ƒc�n1-68,0761-21-8271,��,,,��,,,��,��,��,��,,,,��,��,,��,,,,,,
140,1808152797,H30.8.19,�ዷ,�i���j�A�c��,�Γc�@��,���s�{,���m�R�s,�j�[���u1-18,0773-20-1155,��,,,,,,,,,,,,,,,,��,,,,,,
141,1801081023,H33.11.11,����,�i�L�j��c�Y��,��c�@����,���䌧,����s,���F�Ⓡ��5-11-1,0776-90-3105,��,,��,,,,��,,��,,,,,��,��,,��,,,,,,
142,1801040152,H33.7.9,����,�i�L�j��c�`�b�v�H��,��c�@���L,���䌧,����s,�͍������7-18,0776-56-1909,��,,,,,,��,��,��,��,,,,��,��,,��,,,,,,��
143,1801073290,H33.11.11,����,�i�L�j��c�A�g,��c�@�A��,���䌧,����s,�I�X��5-52,0776-56-2441,��,��,,,,,��,��,��,��,,,,��,��,,��,,,,,,
144,1805162189,H33.9.14,�O��,��c�@�ǈ�,��c�@�ǈ�,���䌧,�I�]�s,�莟��36-1,0778-52-9284,��,,��,��,,,��,��,��,��,,,��,��,��,,��,,,,,,
145,1803167109,H29.8.2,���z,�H�z�H�Ɓi���j,�֓��@���,���䌧,���R�s,�x�H���H��17-9,0779-88-3152,��,,,,,,��,,��,,,,,,,,��,,,,,,
146,1807112458,H31.7.15,��B,�i�L�j���,�R�{�@���L,���䌧,�O���㒆�S�ዷ��,���l28-5,0770-45-1771,��,,,,,,��,��,��,��,,,��,��,��,,��,,,,,,��
147,1805138201,H29.9.25,�O��,���K�X�i���j,���@�_��,���䌧,�z�O�s,�s����16-21,0778-24-1555,��,,,,,,��,��,��,��,,,��,��,��,,��,,,,,,��
148,1801031662,H30.12.7,����,�i���j���Y��,������@�M��,�򕌌�,���Ð�s,���867-12,0573-75-4760,��,,,,,,��,��,��,��,��,,��,��,��,,��,��,,,,,��
149,1807186729,H33.1.19,��B,�㑺�@����,�㑺�@����,�򕌌�,��_�s,�Ñ���1-48-14,0584-81-1870,��,,,,,,��,��,��,��,,,��,��,��,,��,,,,,,��
150,1812037724,H33.2.25,���,�i�L�j�㑺���X,�㑺�@����,���䌧,�����s,��a3-5-13,0776-73-0228,�L,,��,,,,��,��,��,��,,,,��,��,,��,,,,,,��
151,1808126970,H29.9.10,�ዷ,�i�L�j��R,��R�@����,���䌧,��ьS���l��,���ÊC29-9,0773-62-1107,��,,��,,,,��,��,��,��,,,��,��,��,,��,,,,,,��
152,1802145681,H29.10.23,���,�i���j��R�d�@,��R�@����,�ΐ쌧,����s,�≮��1-76,076-216-7123,��,,��,,,,��,��,��,��,,,��,��,��,,��,,,,,,��
153,1807027880,H32.8.1,��B,�i�L�j�E�X�C���Y,�O��@���v,�x�R��,�x�R�s,�����ܘY��2007,076-475-7388,��,��,��,,,,,,,,,,,,,,,,,,,,
154,1807071650,H30.3.19,��B,�i�L�j�E�`�_,���c�@���O,���{,�����s,���|��3-51-2,072-949-8881,��,,,,,,��,,,,,,��,��,��,,,,,,,,
155,1801157853,H32.12.16,���,���c�@�M��,���c�@�M��,���䌧,���s,�t�]���]���㏺�a51-4,0776-89-1063,��,,,,,,,,,,,,,,,,��,,,,,,
156,1807005890,H31.9.11,��B,���c�H�Ɓi���j,���c�@�q,���R��,�q�~�s,���]3-2-46,086-456-5888,��,��,��,��,��,��,��,��,��,��,��,,��,��,��,��,��,,,��,,,��
157,1807016219,H31.9.23,��B,���c�@����,���c�@����,���ꌧ,����S�b�ǒ�,�厚���|237-3,0749-25-1239,��,��,��,,,,��,��,��,��,,,��,��,��,,��,,,,,,
158,1807009989,H30.12.26,��B,���x�z�Ɓi���j,���x�@����,���ꌧ,�Č��s,����1116,0749-55-2108,��,,,,,,,,,,,,,,,,��,,,,,,
159,1801110719,H31.4.22,����,�i���j�F��g,�F��@�g��,���䌧,����s,��{�n��14-11,0776-90-1314,��,,,��,,,��,��,��,��,,,,��,��,,��,,,,,,
160,1808174390,H30.10.17,�ዷ,�i�L�j�E�m�d�C,�F��@���j,���䌧,�O���㒆�S�ዷ��,�R��33-16-1,0770-64-1637,��,,,,,,��,��,��,��,,,��,��,��,,��,,,,,,
161,1801137889,H29.9.17,����,�i���j�~��ݔ��H��,�~��@�[��,���䌧,����s,��{6-5-10,0776-23-5096,��,,,,,,��,,��,,,,,��,,,��,,,,,,
162,1808172029,H30.5.21,�ዷ,�~�}�@��,�~�}�@��,���s�{,���ߎs,���𒆒�9-4,0773-64-1118,��,,��,,,,��,��,��,��,,,��,��,��,,��,,,,,,��
163,1807057205,H30.2.21,��B,�i���j�~�c���X,�~�c�@�R�P,�򕌌�,�򕌎s,���ߒ�2-1,058-247-3881,��,,,,,,��,,,,,,,��,��,,,,,,,,
164,1801156084,H32.8.30,����,�i���j�p�g,�g�c�@�p��,���䌧,����s,��l�2-20-2,0776-54-1515,��,,,,,,��,��,��,��,,,��,��,��,,��,,,,,,
165,1801120690,H33.6.12,����,�h���i���j,�Č��@��,���䌧,����s,���2-11-12,0776-25-1111,��,,,��,,,��,,,,,,,��,,,,,,,,,
166,1808066462,H32.1.16,�ዷ,�p���H�Ɓi�L�j,���R�@�p��,���䌧,��ьS���l��,���q41-1-1,0770-76-2070,��,,��,,,,��,��,��,��,,,��,��,��,,��,,,,,,
167,1807166508,H29.7.10,��B,�h�V�����i���j,���c�@���,���s�{,�F���s,�L�쒬�������J16-2,0774-41-2118,��,,,,,,��,��,��,��,,,��,��,��,,��,,,,,,
168,1812144478,H30.9.10,���,�i���j�G�C�g�H��,�L�Z�@����,���䌧,���s,�ۉ����H��28-28,0776-58-3140,�L,,,,,,��,��,��,,,,��,��,��,,��,,,,,,
169,1808153652,H32.3.18,�ዷ,�i���j�G�[�A���h�G�[,�J�X�@�o,���䌧,�O���㒆�S�ዷ��,�s��22-1-1,0770-62-1177,��,,,,,,,,��,,��,,,,,,,,,,,,
170,1801178971,H32.4.12,����,�i���jASK,�R���@�O,�{�錧,����s,���ڋg�c��������33-1,022-383-1720,��,��,��,��,��,��,��,��,��,��,��,,��,��,��,,��,,,��,,,
171,1802130290,H33.7.13,���,�i�L�j�`�l�b�g���[�f�B���O,�R��@�a�},�x�R��,�X���s,�x�c2277,0766-91-1124,��,,,,,,��,,��,,,,,��,��,,,,,,,,
172,1808111042,H31.11.10,�ዷ,�i�L�j�G�[�X,�{���@���,���s�{,���s�s,�����扺���H��O��47,075-632-0099,��,,,,,,��,��,��,��,,,��,��,��,,��,,,,,,��
173,1807084142,H31.11.19,��B,�G�[�X�J�[�S�i���j,�����@�C��,���ꌧ,��F�s,������149-2,077-598-0305,��,,,,,,��,��,��,��,,,��,��,��,,��,,,,,,
174,1807159482,H33.4.14,��B,�i�L�j�G�[�_�C�J��,�����@���Y,���䌧,�։�s,�Óc��39-2-1,0770-22-6595,��,,,,,,��,��,��,��,,,��,��,��,,��,,,,,,
175,1801128167,H33.1.31,����,�i���j�`�x�j,�v�ہ@���,���Ɍ�,�_�ˎs�����,����l��23-14,078-411-8553,��,��,��,��,��,��,��,,��,,,,,��,��,,��,,,,,,
176,1802061085,H32.5.29,���,�i���j�G�I�l�b�N�X,�s�R�@��,�ΐ쌧,����s,����ܒ�1-19-4,076-238-1181,��,,��,,,,,,,,,,,,,,,,,,,,
177,1802063301,H33.3.8,���,�i���j�]��g,�]��@��,���䌧,���s,��䒬�͘a�c30-6,0776-67-6627,��,,,,,,,,,,,,,��,,,��,,,,,,
178,1801191292,H33.11.3,����,�i���j�G�R�E�A���e�i,��{�@���l,�ΐ쌧,��X�s�s,�Z�g��16-20,090-8264-4890,��,,,,,,��,��,��,��,,,,��,,,,,,,,,
179,1802149810,H31.7.12,���,�i�L�j�G�R�[�T�[�r�X,�R�{�@�Ε�,���䌧,���s,�t�]�������Y��17-71,0776-51-5344,��,,��,��,,,��,��,��,,,,,��,��,,,,,,,,
180,1805144476,H30.9.1,�O��,�i���j�G�R���^��,���X�؁@��q,���䌧,�O���S�z�O��,�D�c7-16-1,0778-36-1500,��,,,,,,��,��,��,��,,,��,��,��,,��,,,,,,