�s���{����,�s�撬����,����,����_�J�i,����_�p��,�Z��,����,�ݒu�ʒu,�ܓx,�o�x,�j���g�C������,�j���g�C�����i���֊�j,�j���g�C�����i�a���j,�j���g�C�����i�m���j,�����g�C������,�����g�C�����i�a���j,�����g�C�����i�m���j,�j�����p�g�C������,�j�����p�g�C�����i�a���j,�j�����p�g�C�����i�m���j,���@�\�g�C����,�Ԉ֎q�g�p�җp�g�C��,���c���p�ݔ��ݒu�g�C��,�I�X�g���C�g�ݒu�g�C��,���p�J�n����,���p�I������,���p�\���ԓ��L����,�x�ٓ�,�摜,�摜_���C�Z���X,���l
���䌧,����s,�i�q����w���ˉ����O�g�C��,,,������2���ڒn�W�iJR����w�t�ߍ��ˉ��j,,,36.062725,136.22365,,,,,,,,,,,�L,,,�L,,,24����,,,,
���䌧,����s,�{���ʂ�n�����ԏ�,,,����s����1���ڋy�ђ���3���ڒn�W,,,36.062647,136.216623,,,,,,,,,,,�L,,,,,,7:00�`23�F00,,,,
���䌧,����s,��蒓�ԏ�,,,����s���3����10-1,,,36.063792,136.218665,,,,,,,,,,,,,,,,,24����,,,,
���䌧,����s,�n��𗬃v���U,,,����s���1����4-1 AOSSA5�K,,,36.060577,136.223497,,,,,,,,,,,�L,,,�L,,,9:00�`22:00,�N���E�N�n,,,
���䌧,����s,������,,,����s������20-17,,,36.026501,136.144855,,,,,,,,,,,�L,,,,,,9:00�`22:00,���j�A��3���j�A�j���A�N���E�N�n,,,
���䌧,����s,�t�F�j�b�N�X�v���U,,,����s�c��1����13-6,,,36.074311,136.217229,,,,,,,,,,,�L,,,�L,,,8:00�`22:00,,,,
���䌧,����s,�Ɏ��Ǌ�,,,����s���蒬29-3,,,35.957127,136.421959,,,,,,,,,,,,,,,,,10:00�`20:00 ��11��1���`3��31���܂ł�10:00�`19:00,�ؗj�A�N���E�N�n,,,
���䌧,����s,�t�F�j�b�N�X�v���U�����Ԓ��ԏ�,,,����s�c��1����13-6,,,36.074186,136.217739,,,,,,,,,,,,,,,,,7:30�`22:30,,,,
���䌧,����s,���Ɂi�{�فj,,,����s���3����10-1,,,36.064093,136.219584,,,,,,,,,,,�L,,,�L,,,8:30�`17:15,�y�j�A���j�A�j���A�N���E�N�n,,,
���䌧,����s,���Ɂi�ʊفj,,,����s���3����10-1,,,36.064076,136.218996,,,,,,,,,,,�L,,,�L,,,8:30�`17:15,�y�j�A���j�A�j���A�N���E�N�n,,,
���䌧,����s,��Ƌǒ���,,,����s���3����13-1,,,36.065728,136.218447,,,,,,,,,,,�L,,,,,,8:30�`17:15,�y�j�A���j�A�j���A�N���E�N�n,,,
���䌧,����s,���R�A����,,,����s���R��7-1,,,35.998771,136.360628,,,,,,,,,,,�L,,,,,,8:30�`17:15,�y�j�A���j�A�j���A�N���E�N�n,,,
���䌧,����s,�����A����,,,����s������28-8-1,,,36.027887,136.149464,,,,,,,,,,,�L,,,,,,8:30�`17:15,�y�j�A���j�A�j���A�N���E�N�n,,,
���䌧,����s,�z�U�A����,,,����s䣍蒬1-68,,,36.039185,136.012247,,,,,,,,,,,,,,,,,8:30�`17:15,�y�j�A���j�A�j���A�N���E�N�n,,,
���䌧,����s,���W�����Z���^�[,,,����s��]�璬2-1,,,36.03185,136.198744,,,,,,,,,,,�L,,,,,,8:30�`17:00,�y�j�A���j�A�j���A�N���E�N�n,,,
���䌧,����s,�N���[���Z���^�[,,,����s����50-41,,,36.061004,136.284021,,,,,,,,,,,�L,,,,,,8:30�`17:15,�y�j�A���j�A�j���A�N���E�N�n,,,
���䌧,����s,����s�h�ЃX�e�[�V����,,,����s�y����3-80-1,,,36.101826,136.185852,,,,,,,,,,,�L,,,,,,9:00�`17:15,�y�j�A���j�A�j���A�N���E�N�n,,,
���䌧,����s,�h�ЃZ���^�[,,,����s�a�c��2����2207,,,36.047303,136.250343,,,,,,,,,,,�L,,,,,,9:00�`17:00(16:30�܂łɓ��ق����肢���܂��B),���j�A��3���j�A�j�Փ��A�N���E�N�n(12��28���`1��4�� ),,,
���䌧,����s,�����₩�h�[��,,,����s����J��2-6-1,,,36.125119,136.167917,,,,,,,,,,,�L,,,,,,9:00�`18:00,12��28���`1��4��,,,�Վ��x�ق���
���䌧,����s,�������ƃ����h�㓪��,,,����s�V������3-10,,,36.124927,136.168823,,,,,,,,,,,�L,,,�L,,,�x�ْ�,�x�ْ�,,,
���䌧,����s,��������ҕ����Z���^�[,,,����s������28-8-1,,,36.027887,136.149464,,,,,,,,,,,�L,,,,,,10:00�`18:00�@���~�G��10:00�`17:00,���j�A�j���A12��28���`1��4��,,,
���䌧,����s,�����̍���҂ӂꂠ���Z���^�[,,,����s������1-91-2,,,36.038765,136.010779,,,,,,,,,,,,,,,,,8:30�`17:00,�y�j�A���j�A�j���A�N���E�N�n,,,���p��]�̏ꍇ�͎��O�ɒn���P�A���i��(20-5400)�܂ł��A�����������B
���䌧,����s,���R�y���y�����@,,,����s�s�g��26-15,,,36.018325,136.332778,,,,,,,,,,,,,,,,,9:00�`16:00,���j�A�j���A�N���E�N�n,,,
���䌧,����s,���N�Ǘ��Z���^�[,,,����s�铌4����14-30,,,36.059011,136.237222,,,,,,,,,,,�L,,,,,,8:30�`17:15,�y�j�A���j�A�j���A�N���E�N�n,,,
���䌧,����s,�������N�Ǘ��Z���^�[,,,����s������28-8-1,,,36.028156,136.149411,,,,,,,,,,,�L,,,�L,,,8:30�`17:15,�y�j�A���j�A�j���A�N���E�N�n,,,
���䌧,����s,����,,,����s���c��11-1,,,36.060314,136.153132,,,,,,,,,,,�L,,,,,,8:30�`17:15,1��1���A1��2��,,,
���䌧,����s,����s���[�N�v���U,,,����s����1����26-10,,,36.078389,136.221153,,,,,,,,,,,�L,,,,,,8:30�`17:15,���j�A�j���A�N���E�N�n,,,
���䌧,����s,���䋣�֏�,,,����s������2-65,,,36.060702,136.199218,,,,,,,,,,,�L,,,�L,,,�J��10:00�` (�O������ 7:30�`),,,,
���䌧,����s,����T�C�N���n�E�X,,,����s��O2����1101,,,36.047787,136.193634,,,,,,,,,,,,,,,,,24����,,,,���p�҂̂ݗ��p�B
���䌧,����s,�z�U�ӂ邳�Ǝ�����,,,����s���q��50-1-2,,,36.012623,135.992705,,,,,,,,,,,�L,,,,,,9:00�`17:00,12��29���`1��1��,,,�v�{�ݓ��ٗ�
���䌧,����s,���R�ό��^�[�~�i��,,,����s������2-11-6,,,35.998797,136.364539,,,,,,,,,,,�L,,,,,,24����,,,,
���䌧,����s,�z�O����̗�����,,,����s���q��43-25,,,36.012901,135.990732,,,,,,,,,,,�L,,,,,,9:00�`17:00,12��29���`1��1��,,,�v�{�ݓ��ٗ�
���䌧,����s,�z�O����̗�����g�̉�,,,����s������1-94,,,36.037589,136.010235,,,,,,,,,,,�L,,,,,,10:00�`21:00,���T�Ηj��,,,�v�{�ݗ��p��
���䌧,����s,�K���K���R�z�O����̗��L�����v��,,,����s�ԍ⒬66-84,,,36.004285,135.98536,,,,,,,,,,,�L,,,,,,24����,,,,�v�{�ݗ��p��
���䌧,����s,���ꏬ���Y�̗��t�@�~���[�p�[�N,,,����s�򋳎���16-8-1,,,35.981759,136.300683,,,,,,,,,,,�L,,,,,,8:30�`17:00,11�����{�`4�����{,,,
���䌧,����s,���쉀�n�ό��g�C��,,,����s���쒬�n�W,,,36.10144,136.035882,,,,,,,,,,,,,,,,,24����,,,,
���䌧,����s,����C������ό��g�C��,,,����s���쒬�n�W,,,36.09123,136.031263,,,,,,,,,,,,,,,,,24����,,,,
���䌧,����s,���O���ό��g�C��,,,����s���O���n�W,,,36.069735,136.021318,,,,,,,,,,,�L,,,,,,24����,,,,
���䌧,����s,�g�����n�ό��g�C��,,,����s�쐛�����n�W,,,36.104286,136.038932,,,,,,,,,,,�L,,,,,,24����,,,,
���䌧,����s,�喡���O�֏�,,,�喡���n�W,,,36.04942,136.016766,,,,,,,,,,,,,,,,,24����,,,,
���䌧,����s,䣍���O�֏�,,,䣍蒬�n�W,,,36.046564,136.011959,,,,,,,,,,,�L,,,,,,24����,,,,
���䌧,����s,�z�U�C������k���O�֏�,,,�������n�W,,,36.035269,136.012021,,,,,,,,,,,�L,,,,,,24����,,,,
���䌧,����s,�z�U�C���������O�֏�,,,�������n�W,,,36.031827,136.009398,,,,,,,,,,,�L,,,,,,24����,,,,
���䌧,����s,���q���O�֏�,,,���q���n�W,,,36.011601,135.988461,,,,,,,,,,,,,,,,,24����,,,,
���䌧,����s,�ԍ���O�֏�,,,�ԍ⒬�n�W,,,36.004038,135.975476,,,,,,,,,,,,,,,,,24����,,,,
���䌧,����s,��L���O�֏�,,,��L���n�W,,,36.000924,135.971388,,,,,,,,,,,,,,,,,24����,,,,
���䌧,����s,���c�����O�֏�,,,���c�����n�W,,,36.00013,135.968684,,,,,,,,,,,,,,,,,24����,,,,
���䌧,����s,���莛�ό��g�C��,,,���蒬�n�W,,,36.121532,136.058169,,,,,,,,,,,,,,,,,24����,,,,
���䌧,����s,�T�����n�ό��g�C��,,,���蒬�n�W,,,36.124474,136.054352,,,,,,,,,,,,,,,,,24����,�~�G�͕�,,,
���䌧,����s,�鑃�C������ƒ��ό��g�C��,,,�ƒ����n�W,,,36.135362,136.074492,,,,,,,,,,,�L,,,,,,24����,�ċG�ȊO�͕�,,,
���䌧,����s,�鑃�C������l�Z�P�ό��g�C��,,,�l�Z���n�W,,,36.134651,136.072796,,,,,,,,,,,�L,,,,,,24����,,,,
���䌧,����s,�鑃�C������l�Z�Q�ό��g�C��,,,�l�Z���n�W,,,36.134227,136.071283,,,,,,,,,,,,,,,,,24����,�ċG�ȊO�͕�,,,
���䌧,����s,�鑃�C������l�Z�R�ό��g�C��,,,�l�Z���n�W,,,36.132719,136.069835,,,,,,,,,,,�L,,,,,,24����,�ċG�ȊO�͕�,,,
���䌧,����s,�鑃�C������l�Z�S�ό��g�C��,,,�l�Z���n�W,,,36.132191,136.067451,,,,,,,,,,,,,,,,,24����,�ċG�ȊO�͕�,,,
���䌧,����s,������ό����H�ό��g�C��,,,�c�̒J���n�W,,,36.101104,136.167477,,,,,,,,,,,,,,,,,24����,,,,
���䌧,����s,���ꉀ�n�ό��g�C��,,,�򋳎��n�W,,,35.980433,136.306901,,,,,,,,,,,�L,,,,,,24����,,,,
���䌧,����s,�������r�ό��g�C��,,,��c�����n�W,,,36.015899,136.023654,,,,,,,,,,,�L,,,,,,24����,,,,
���䌧,����s,����R�ό��g�C��,,,�呺���n�W,,,35.991729,136.229951,,,,,,,,,,,,,,,,,24����,,,,
���䌧,����s,����R�呺���g�C��,,,�呺���n�W,,,35.99671,136.241162,,,,,,,,,,,,,,,,,24����,,,,
���䌧,����s,����R���g�C��,,,��㒬�n�W,,,36.001275,136.225766,,,,,,,,,,,,,,,,,24����,,,,
���䌧,����s,����s�����⒃�����p��,,,����s���H1����8-5,,,36.059987,136.211138,,,,,,,,,,,�L,,,,,,9:00�`17:15,���j���A�N���E�N�n�A�W���ւ����ɂ��Վ��x�ٓ�,,,�v�{�ݓ��ٗ�
���䌧,����s,����s�k�����L�O���w��,,,����s���H1����6-34,,,36.059768,136.211205,,,,,,,,,,,�L,,,,,,9:00�`17:15,���j���A�N���E�N�n�A�W���ւ����ɂ��Վ��x�ٓ�,,,�v�{�ݓ��ٗ�
���䌧,����s,����s���J���q����Օ�������,,,����s��˃m����28-37,,,35.997652,136.293149,,,,,,,,,,,�L,,,,,,9:00�`17:00(���� �`16:30),12��28���`1��4��,,,12��28���`1��4�����g�C���͎g�p�ł��܂�
���䌧,����s,�����{�_��(����򐅉��~)�뉀,,,����s��i3����11-36,,,36.068636,136.224261,,,,,,,,,,,,,,,,,9:00�`19:00�@��11��6���`2��������9:00�`17:00,�N���E�N�n,,,
���䌧,����s,����s���J�j�Ռ����Z���^�[,,,����s���ɓ���10-48,,,36.003215,136.297955,,,,,,,,,,,,,,,,,9:00�`17:15,�N���E�N�n�@1���`2���̓y�j�A���j,,,
���䌧,����s,����s�O���t�B�X�L�O��,,,����s����3����5��4��,,,36.062816,136.21414,,,,,,,,,,,�L,,,,,,10:00�`19:00�i12��1�����痂�N��2�������܂ł�10�F00�`18�F00�j,�N���E�N�n,,,
���䌧,����s,���J���X�g�����g,,,����s��˃m����10-48 ���J�j�Ռ����Z���^�[��,,,36.003215,136.297955,,,,,,,,,,,�L,,,�L,,,9:00�`17:15,�N���E�N�n,,,
���䌧,����s,����s���R�j������,,,����s���H�㒬147,,,36.056628,136.209552,,,,,,,,,,,�L,,,,,,9:00�`17:15(���ق�16:45�܂�),���j(�j���͏���)�A�j���̗������A�N���E�N�n,,,
���䌧,����s,����s���p��,,,����s���n3����1111,,,36.038999,136.234065,,,,,,,,,,,�L,,,,,,9:00�`17:15,���j(�j���͏���)�A�j���̗���(���j�͏���)�A�N���E�N�n,,,
���䌧,����s,����s�����y���j������,,,����s��i3����12-1,,,36.068315,136.222894,,,,,,,,,,,�L,,,,,,9:00�`19:00�@��11��6���`2��������9:00�`17:00,�N���E�N�n�A�W���ւ����ɂ��Վ��x�ٓ�,,,
���䌧,����s,�������y������,,,����s������21-17,,,36.026239,136.145056,,,,,,,,,,,,,,,,,�Ηj�`���j 10:00�`19:00�A�y�j�E���j 10:00�`18:00,���j�A��3���j�A�j���A�U�֋x���A�N���E�N�n(�Վ��x�ٗL��),,,
���䌧,����s,�n�抈�����{��,,,����s������24-12-1,,,36.035505,136.107578,,,,,,,,,,,,,,,,,9�F00�`17�F00,�N���E�N�n,,,�َ݊{�݂̂��ߑ݂��o�����ȊO�͎{��
���䌧,����s,�_���{�݃}�C�t�@�[������,,,����s������95-2-1,,,36.017093,136.143489,,,,,,,,,,,,,,,,,24����,,,,���p�҂̂ݎg�p
���䌧,����s,�؂�����̐X,,,����s���J��34-5-1,,,35.996332,136.360626,,,,,,,,,,,�L,,,�L,,,24����,12��16���`3��14���i�ϐ�󋵂ɂ��j,,,
���䌧,����s,���R����,,,����s�Ȑ򒬒n�W,,,36.011656,136.276018,,,,,,,,,,,,,,,,,24����,,,,
���䌧,����s,�ӂꂠ���p�[�N�Ȃ���,,,����s������1-93-1,,,36.038288,136.010469,,,,,,,,,,,�L,,,,,,24����,,,,
���䌧,����s,���������̐X,,,����s���H����40��6�Ԓn1,,,36.03165,136.135645,,,,,,,,,,,�L,,,�L,,,24����,12��16���`3��14���i�ϐ�󋵂ɂ��j,,,
���䌧,����s,���J�������琅�̉w�@�ӂꂠ������,,,����s���g�ꒆ����1-1-1,,,36.020295,136.294681,,,,,,,,,,,�L,,,�L,,,24����,,,,
���䌧,����s,���R�e������,,,����s�����񃖒�23-11,,,36.01711,136.269269,,,,,,,,,,,,,,,,,24����,,,,
���䌧,����s,���J�������琅�̉w�@���O�g�C��,,,����s���g�ꒆ����1-1-1,,,36.020742,136.292991,,,,,,,,,,,�L,,,,,,24����,,,,
���䌧,����s,���J�������琅�̉w�@���O�g�C���A,,,����s���g�ꒆ����1-1-1,,,36.02015,136.2948,,,,,,,,,,,,,,,,,24����,,,,
���䌧,����s,��g�_�����O�g�C��,,,����s���J���n�W,,,36.020815,136.088767,,,,,,,,,,,,,,,,,24����,,,,12��1���`3��31����
���䌧,����s,���|�Z���^�[,,,����s���쒬1-30,,,36.141388,136.133866,,,,,,,,,,,�L,,,,,,8:30�`17:15 ,�y�j�A���j�j���A�N���E�N�n,,,
���䌧,����s,����s���������s��,,,����s��a�c1����101,,,36.090183,136.24628,,,,,,,,,,,�L,,,�L,,,�N�����΁i8:30�`14:30�j�y�ђn��ӂꂠ���L��i8:30�`17:00�j�݈̂�ʎs�������,"�N�����Γ��j(1��5���y��12��25������12��30���܂ł������j�A�j���A12��31���A1��2������1��4���A���̑��Վ��x���
�n��ӂꂠ���L���12��1������2������",,,"�N�����΂̃g�C���̂݃I�X�g���C�g�Ή�
�N�����΋y�ђn��ӂꂠ���L��ȊO�́A��ʎs���̓���͏o���܂���"
���䌧,����s,�V�n�͐����,,,����s�V�r���n��,,,36.103371,136.215612,,,,,,,,,,,,,,,,,9:00�`17:00,�ؗj�A12��1���`3��31��,,,
���䌧,����s,�����͐����,,,����s�M�����n��,,,36.101657,136.230887,,,,,,,,,,,,,,,,,9:00�`17:00,���j�A12��1���`3��31��,,,
���䌧,����s,�L�����O�g�C��,,,�L��1���ڒn�W,,,36.056216,136.220755,,,,,,,,,,,,,,,,,24����,,,,
���䌧,����s,���H�쏟�����O�g�C��,,,����2���ڒn�W,,,36.05364,136.230948,,,,,,,,,,,�L,,,�L,,,24����,,,,
���䌧,����s,���H��o����O�g�C��,,,����3���ڒn�W,,,36.050479,136.223083,,,,,,,,,,,,,,,,,24����,,,,
���䌧,����s,�і���O�g�C��,,,�і�1���ڒn�W,,,36.05636,136.217456,,,,,,,,,,,,,,,,,24����,,,,
���䌧,����s,��̒J���h����,,,�������n�W,,,36.036516,136.040462,,,,,,,,,,,,,,,,,24����,,,,
���䌧,����s,���R���N�^������,,,����s����50-5,,,36.060032,136.281892,,,,,,,,,,,�L,,,�L,,,�����E�y�j9:00�`21:00�A���j�E�j��9:00�`18:00,�N���E�N�n,,,�g�C���P�i�{�ݓ��j
���䌧,����s,���R���N�^������,,,����s����50-5,,,36.059421,136.28197,,,,,,,,,,,�L,,,,,,24����,,,,�g�C���Q�i�~�n���j
���䌧,����s,���H�R�����V���n,,,����s�R����58-97,,,36.050856,136.200497,,,,,,,,,,,�L,,,�L,,,9:30�`16:30,���j(���j���j���̏ꍇ�͂��̗�����)�A12��29���`2�������A�n�s�W������12��29���`1��3��,,,
���䌧,����s,�k�̏��隬����,,,����s����1����21,,,36.060277,136.219638,,,,,,,,,,,�L,,,,,,�k�̏��W�������ٓ��@9�F00�`18�F00,�N�����x,,,
���䌧,����s,�ь���,,,����s����2����11,,,36.064844,136.213421,,,,,,,,,,,,,,,,,24����,,,,
���䌧,����s,�_������,,,����s��i4����8,,,36.067779,136.219209,,,,,,,,,,,,,,,,,24����,,,,
���䌧,����s,��򐅌���,,,����s��i3����12,,,36.068506,136.223291,,,,,,,,,,,�L,,,,,,24����,,,,
���䌧,����s,��������,,,����s������7,,,36.059464,136.212852,,,,,,,,,,,,,,,,,24����,,,,
���䌧,����s,�Ǝ����,,,����s�Ǝ�2����3,,,36.066355,136.209749,,,,,,,,,,,,,,,,,24����,,,,
���䌧,����s,�͓����,,,����s�t�R2���ڂV,,,36.068365,136.213029,,,,,,,,,,,,,,,,,24����,,,,
���䌧,����s,�t�R����,,,����s�c��2����2,,,36.071044,136.214899,,,,,,,,,,,,,,,,,24����,,,,
���䌧,����s,�c������,,,����s�c��1����6,,,36.072206,136.217417,,,,,,,,,,,,,,,,,24����,,,,
���䌧,����s,�������,,,����s���{4����9,,,36.072241,136.221864,,,,,,,,,,,,,,,,,24����,,,,
���䌧,����s,�����}����,,,����s��i1����15,,,36.068768,136.229141,,,,,,,,,,,,,,,,,24����,,,,
���䌧,����s,���R����,,,����s���V�o3����3,,,36.061895,136.229222,,,,,,,,,,,,,,,,,24����,,,,
���䌧,����s,�鏟����,,,����s��K1����10,,,36.058365,136.227666,,,,,,,,,,,,,,,,,24����,,,,
���䌧,����s,�і����,,,����s���ؓc1����16,,,36.054815,136.215778,,,,,,,,,,,,,,,,,24����,,,,
���䌧,����s,�Ό���,,,����s���H1����18,,,36.060097,136.208338,,,,,,,,,,,,,,,,,24����,,,,
���䌧,����s,�L�y����,,,����s�L�y��1,,,36.062816,136.206841,,,,,,,,,,,,,,,,,24����,,,,
���䌧,����s,�O�G����,,,����s�Ǝ�3����1,,,36.065615,136.207496,,,,,,,,,,,,,,,,,24����,,,,
���䌧,����s,������,,,����s����2����11,,,36.071812,136.209016,,,,,,,,,,,,,,,,,24����,,,,
���䌧,����s,���{����,,,����s���{3����24,,,36.075096,136.222055,,,,,,,,,,,,,,,,,24����,,,,
���䌧,����s,�i������,,,����s���{1����24,,,36.07391,136.229294,,,,,,,,,,,,,,,,,24����,,,,
���䌧,����s,��׌���,,,����s���V�o4����9,,,36.063436,136.233092,,,,,,,,,,,,,,,,,24����,,,,
���䌧,����s,�铌����,,,����s�铌1����17,,,36.062044,136.233435,,,,,,,,,,,,,,,,,24����,,,,
���䌧,����s,������,,,����s���ؓc2����6,,,36.053469,136.213359,,,,,,,,,,,,,,,,,24����,,,,
���䌧,����s,�s������,,,����s���ؓc3����15,,,36.054175,136.210532,,,,,,,,,,,,,,,,,24����,,,,
���䌧,����s,�u�������,,,����s�u���2����12,,,36.071495,136.237343,,,,,,,,,,,,,,,,,24����,,,,
���䌧,����s,�O������,,,����s�w��2����3,,,36.06941,136.200586,,,,,,,,,,,,,,,,,24����,,,,
���䌧,����s,�k�O����,,,����s���{1����31,,,36.074678,136.23166,,,,,,,,,,,,,,,,,24����,,,,
���䌧,����s,�q�̓�����,,,����s��{4����4,,,36.080054,136.207356,,,,,,,,,,,,,,,,,24����,,,,
���䌧,����s,�d������,,,����s��{3����19,,,36.081574,136.214542,,,,,,,,,,,,,,,,,24����,,,,
���䌧,����s,�o�c����,,,����s��{2����5,,,36.08047,136.219126,,,,,,,,,,,,,,,,,24����,,,,
���䌧,����s,�{�O����,,,����s����1����40,,,36.079662,136.223052,,,,,,,,,,,,,,,,,24����,,,,
���䌧,����s,���J������,,,����s���J��1����601,,,36.073485,136.236622,,,,,,,,,,,,,,,,,24����,,,,
���䌧,����s,��v�k����,,,����s��̋{2����21,,,36.087134,136.225697,,,,,,,,,,,,,,,,,24����,,,,
���䌧,����s,�������,,,����s��̋{1����8,,,36.086511,136.22961,,,,,,,,,,,,,,,,,24����,,,,
���䌧,����s,���،���,,,����s����1����401,,,36.096766,136.225568,,,,,,,,,,,,,,,,,24����,,,,
���䌧,����s,������,,,����s����2����23,,,36.071487,136.198167,,,,,,,,,,,,,,,,,24����,,,,
���䌧,����s,��V������,,,����s�铌4����7,,,36.0592,136.236048,,,,,,,,,,,,,,,,,24����,,,,
���䌧,����s,���k�����,,,����s�铌4����23,,,36.058727,136.239875,,,,,,,,,,,,,,,,,24����,,,,
���䌧,����s,��������,,,����s����3����18,,,36.054332,136.233009,,,,,,,,,,,,,,,,,24����,,,,
���䌧,����s,����������,,,����s����1����15,,,36.052246,136.23568,,,,,,,,,,,,,,,,,24����,,,,
���䌧,����s,����������,,,����s����2����23,,,36.050498,136.240004,,,,,,,,,,,,,,,,,24����,,,,
���䌧,����s,�r�c����,,,����s�ԓ���2����7,,,36.039574,136.210878,,,,,,,,,,,,,,,,,24����,,,,
���䌧,����s,�Z��������,,,����s�ԓ���1����7,,,36.034104,136.215593,,,,,,,,,,,,,,,,,24����,,,,
���䌧,����s,�哇����,,,����s�哇��7���R��901,,,36.03072,136.208241,,,,,,,,,,,,,,,,,24����,,,,
���䌧,����s,���w������,,,����s���w��1����701,,,36.067636,136.186387,,,,,,,,,,,,,,,,,24����,,,,
���䌧,����s,�V�c�ˌ���,,,����s�V�c�˒�604,,,36.08817,136.209014,,,,,,,,,,,,,,,,,24����,,,,
���䌧,����s,�M������,,,����s���ؖk2����1012,,,36.099947,136.231131,,,,,,,,,,,,,,,,,24����,,,,
���䌧,����s,�Ō�����,,,����s�J��1����301,,,36.076898,136.239379,,,,,,,,,,,,,,,,,24����,,,,
���䌧,����s,��������,,,����s�݂̂�4����7,,,36.049719,136.205393,,,,,,,,,,,,,,,,,24����,,,,
���䌧,����s,�ۓc����,,,����s����5����9,,,36.076427,136.205854,,,,,,,,,,,,,,,,,24����,,,,
���䌧,����s,�[������,,,����s��{6����12,,,36.080641,136.198626,,,,,,,,,,,,,,,,,24����,,,,
���䌧,����s,��c����,,,����s����6����32,,,36.078094,136.198199,,,,,,,,,,,,,,,,,24����,,,,
���䌧,����s,��������,,,����s�u���1����9,,,36.068716,136.233763,,,,,,,,,,,,,,,,,24����,,,,
���䌧,����s,�l�c�����,,,����s�l�c��1����8,,,36.065694,136.235742,,,,,,,,,,,,,,,,,24����,,,,
���䌧,����s,��]�c����,,,����s��莛1����6,,,36.081979,136.231155,,,,,,,,,,,,,,,,,24����,,,,
���䌧,����s,�ᐙ�l����,,,����s�ᐙ�l2����402,,,36.061682,136.186481,,,,,,,,,,,,,,,,,24����,,,,
���䌧,����s,�L������,,,����s�L��1����5,,,36.06838,136.192985,,,,,,,,,,,,,,,,,24����,,,,
���䌧,����s,�O������,,,����s���J2����8,,,36.073364,136.191818,,,,,,,,,,,,,,,,,24����,,,,
���䌧,����s,�䑠����,,,����s���z2����20,,,36.064889,136.199661,,,,,,,,,,,,,,,,,24����,,,,
���䌧,����s,�k�]����,,,����s���z3����5,,,36.066192,136.19593,,,,,,,,,,,,,,,,,24����,,,,
���䌧,����s,���c����,,,����s�]�[��2-11,,,36.031045,136.218117,,,,,,,,,,,,,,,,,24����,,,,
���䌧,����s,����������,,,����s������2����1504,,,36.09527,136.212294,,,,,,,,,,,,,,,,,24����,,,,
���䌧,����s,���V����,,,����s������1����801,,,36.08967,136.210636,,,,,,,,,,,,,,,,,24����,,,,
���䌧,����s,�[������,,,����s���a1����2001,,,36.054919,136.243612,,,,,,,,,,,,,,,,,24����,,,,
���䌧,����s,�������,,,����s�a�c2����401,,,36.051109,136.243153,,,,,,,,,,,�L,,,,,,24����,,,,
���䌧,����s,���Ή͌�����,,,����s���Ή͌�1����5-1,,,36.060451,136.195879,,,,,,,,,,,,,,,,,24����,,,,
���䌧,����s,�ᑐ����,,,����s���J��2����405,,,36.079118,136.235066,,,,,,,,,,,,,,,,,24����,2023�N9��30���܂ŕ�,,,
���䌧,����s,�F�����,,,����s���Ή͌�4����720,,,36.060644,136.191306,,,,,,,,,,,,,,,,,24����,,,,
���䌧,����s,���ؒ���2������,,,����s���ؒ���2����3601,,,36.091009,136.236029,,,,,,,,,,,,,,,,,24����,,,,
���䌧,����s,�ђˌ���,,,����s�ђ˒�7-54,,,36.065531,136.185732,,,,,,,,,,,,,,,,,24����,,,,
���䌧,����s,�k�O����,,,����s���ؖk4����304,,,36.096113,136.235686,,,,,,,,,,,,,,,,,24����,,,,
���䌧,����s,�g�c����,,,����s�V��3����901,,,36.082324,136.251489,,,,,,,,,,,,,,,,,24����,,,,
���䌧,����s,�V�ۓ�����,,,����s�V��3����1901,,,36.08085,136.2533,,,,,,,,,,,,,,,,,24����,,,,
���䌧,����s,���a������,,,����s����s�݂̂�1����14,,,36.048672,136.216395,,,,,,,,,,,,,,,,,24����,,,,
���䌧,����s,�����쒆������,,,����s������2����801,,,36.11719,136.21683,,,,,,,,,,,,,,,,,24����,,,,
���䌧,����s,�O�c������,,,����s�O�c��2����302,,,36.085475,136.192247,,,,,,,,,,,,,,,,,24����,,,,
���䌧,����s,��t����,,,����s�O�Y��2����501,,,36.077446,136.187851,,,,,,,,,,,,,,,,,24����,,,,
���䌧,����s,�]�Y����,,,����s�k�l�c��3����13,,,36.067883,136.24627,,,,,,,,,,,,,,,,,24����,,,,
���䌧,����s,���l����,,,����s��k��1����21,,,36.062175,136.249724,,,,,,,,,,,,,,,,,24����,,,,
���䌧,����s,��莛2������,,,����s��莛3����2,,,36.081404,136.228425,,,,,,,,,,,,,,,,,24����,,,,
���䌧,����s,�H������,,,����s�V�c��2����27,,,36.088252,136.201514,,,,,,,,,,,,,,,,,24����,,,,
���䌧,����s,���n������,,,����s���n2����1108,,,36.041801,136.239384,,,,,,,,,,,,,,,,,24����,,,,
���䌧,����s,�a�c������,,,����s�a�c��2����301,,,36.051009,136.248946,,,,,,,,,,,,,,,,,24����,,,,
���䌧,����s,��y�C�w�O�ӂꂠ������,,,����s���c��5-1-5,,,36.010783,136.217017,,,,,,,,,,,,,,,,,24����,,,,
���䌧,����s,�V�c�˂ӂꂠ������,,,����s�V�c��2����50,,,36.090868,136.205039,,,,,,,,,,,�L,,,,,,24����,,,,
���䌧,����s,�ђ˒�������,,,����s�ђ˒�31-208,,,36.06358,136.183484,,,,,,,,,,,,,,,,,24����,,,,
���䌧,����s,���J�_�БO����,,,����s����3����1006,,,36.079907,136.22666,,,,,,,,,,,,,,,,,24����,,,,
���䌧,����s,��������,,,����s���3����11,,,36.065409,136.218874,,,,,,,,,,,�L,,,�L,,,24����,,,,
���䌧,����s,������,,,����s�Ԍ�1����3,,,36.070201,136.21054,,,,,,,,,,,,,,,,,24����,,,,�g�C���P�i�������j
���䌧,����s,������,,,����s�Ԍ�1����3,,,36.069475,136.212203,,,,,,,,,,,�L,,,,,,24����,,,,�g�C���Q�i�e�j�X�R�[�g���j
���䌧,����s,�R������,,,����s����4����8,,,36.046436,136.206742,,,,,,,,,,,,,,,,,24����,,,,
���䌧,����s,�a�c����,,,����s��K4����4,,,36.056073,136.237907,,,,,,,,,,,,,,,,,24����,,,,
���䌧,����s,�J������,,,����s���J��3����801,,,36.080889,136.234436,,,,,,,,,,,,,,,,,24����,,,,
���䌧,����s,�ď�����,,,����s�ď�1����10,,,36.064644,136.240532,,,,,,,,,,,,,,,,,24����,,,,
���䌧,����s,��������,,,����s��{5����5,,,36.080362,136.20277,,,,,,,,,,,,,,,,,24����,,,,
���䌧,����s,���ؒ�������,,,����s���ؒ���1����601,,,36.091733,136.230721,,,,,,,,,,,,,,,,,24����,,,,
���䌧,����s,���J����,,,����s���J1����6,,,36.071326,136.192875,,,,,,,,,,,,,,,,,24����,,,,
���䌧,����s,��������,,,����s���z1����13,,,36.066602,136.200846,,,,,,,,,,,,,,,,,24����,,,,�g�C���P�i�O���E���h���j
���䌧,����s,��������,,,����s���z1����13,,,36.067031,136.201809,,,,,,,,,,,,,,,,,24����,,,,�g�C���Q�i�������j
���䌧,����s,�k������,,,����s��̋{3����33,,,36.086427,136.217524,,,,,,,,,,,,,,,,,24����,,,,
���䌧,����s,�X�c����,,,����s�Îs3����201-1,,,36.106136,136.227883,,,,,,,,,,,,,,,,,24����,,,,
���䌧,����s,�V�ی���,,,����s�V��1����701,,,36.079861,136.247179,,,,,,,,,,,,,,,,,24����,,,,
���䌧,����s,���n��������,,,����s���n3����1306,,,36.039535,136.233585,,,,,,,,,,,�L,,,,,,24����,,,,
���䌧,����s,���J��������,,,����s���J2����2501,,,36.039823,136.201367,,,,,,,,,,,,,,,,,24����,,,,
���䌧,����s,��������,,,����s����2����10,,,36.079857,136.231528,,,,,,,,,,,,,,,,,24����,,,,
���䌧,����s,�_��������,,,����s�_2����901,,,36.048132,136.227623,,,,,,,,,,,,,,,,,24����,,,,
���䌧,����s,�萳����,,,����s�ΐ���201,,,36.117183,136.225367,,,,,,,,,,,,,,,,,24����,,,,
���䌧,����s,����������,,,����s�k�l�c��1����23,,,36.065561,136.246358,,,,,,,,,,,�L,,,,,,24����,,,,
���䌧,����s,���]����,,,����s�ؓc3����2001,,,36.043387,136.223822,,,,,,,,,,,,,,,,,24����,,,,
���䌧,����s,���a����,,,����s���a2����801,,,36.05516,136.247967,,,,,,,,,,,�L,,,,,,24����,,,,
���䌧,����s,�a�c��������,,,����s�a�c��1����1001,,,36.045278,136.244947,,,,,,,,,,,�L,,,,,,24����,,,,
���䌧,����s,�ӂ���������,,,����s��2����701,,,36.040118,136.189509,,,,,,,,,,,�L,,,,,,24����,,,,
���䌧,����s,�ᐙ��������,,,����s�ᐙ1����2601,,,36.058256,136.189562,,,,,,,,,,,�L,,,�L,,,24����,,,,
���䌧,����s,�Ή�����,,,����s��2����801,,,36.049251,136.19096,,,,,,,,,,,�L,,,�L,,,24����,,,,
���䌧,����s,�O���[���n�C�c5������,,,����s�O���[���n�C�c10����,,,36.039405,136.167316,,,,,,,,,,,,,,,,,24����,,,,
���䌧,����s,�O���l�n�}�i�X����,,,����s��K��38,,,36.147622,136.091675,,,,,,,,,,,�L,,,,,,8:30�`17:00,,,,�ӂꂠ���w�K�ٓ�
���䌧,����s,���H�R����,,,����s���R�J����,,,36.051369,136.20094,,,,,,,,,,,�L,,,,,,24����,,,,�g�C���P�i���H�R�����V���n�O�j
���䌧,����s,���H�R����,,,����s���R�J����,,,36.053471,136.204062,,,,,,,,,,,�L,,,,,,24����,,,,�g�C���Q�i���a���O�j
���䌧,����s,���H�R����,,,����s���R�J����,,,36.054514,136.20612,,,,,,,,,,,�L,,,,,,24����,,,,�g�C���R�i���A���L����j
���䌧,����s,���H�R����,,,����s���R�J����,,,36.055533,136.207831,,,,,,,,,,,�L,,,�L,,,24����,,,,�g�C���S�i���Վ���ԑO�j
���䌧,����s,���H�R����,,,����s���R�J����,,,36.05722,136.211975,,,,,,,,,,,,,,,,,24����,,,,�g�C���T�i�����_�БO�j
���䌧,����s,���H�R����,,,����s���R�J����,,,36.05763,136.208284,,,,,,,,,,,,,,,,,24����,,,,�g�C���U�i�^������j
���䌧,����s,���H�R����,,,����s���R�J����,,,36.056194,136.209421,,,,,,,,,,,,,,,,,24����,,,,�g�C���V�i�O�i�L����j
���䌧,����s,�����R,,,,,,36.043187,136.204602,,,,,,,,,,,�L,,,,,,24����,,,,�W�]��t��
���䌧,����s,�J���`���[�p�[�N,,,����s����5����4,,,36.046631,136.200366,,,,,,,,,,,�L,,,,,,24����,,,,
���䌧,����s,���R����,,,����s�͐�����,,,36.056949,136.281399,,,,,,,,,,,,,,,,,24����,,,,�g�C���P�i�R���k���j
���䌧,����s,���R����,,,����s�͐�����,,,36.05289,136.282863,,,,,,,,,,,�L,,,,,,24����,�~�G��,,,�g�C���R�i�W�]�L��t�߁j
���䌧,����s,���R����,,,����s�͐�����,,,36.054546,136.282386,,,,,,,,,,,,,,,,,24����,,,,�g�C���S�i�x�e�L��t�߁j