���,������,�L������,�r�o��,���Ȓ��ԏ�����,���Ȓ��ԏ����ʂ̂������Ȓ��ԏ������,���Ȓ��ԏ�����̂����Đ����p��,���Ȓ��ԏ�����̂������ȍŏI������,���Ȓ��ԏ�����̂����ϑ����ԏ�����,���Ȓ��ԏ�����̂����ϑ����ڍŏI������,���Ȓ��ԏ�����̂������̑���,���Ȗ�������,���Ȗ������̂����Đ����p��,���Ȗ������̂������ȍŏI������,���Ȗ������̂����ϑ����ԏ�����,���Ȗ������̂����ϑ����ڍŏI������,���Ȗ������̂������̑���,���o��,���ȍŏI������,������n��̂�������,������n��̂������O,�ϑ�������,�ϑ������ʂ̂����ϑ����ڍŏI������,�ϑ����ڍŏI�����ʂ̂���������̂��Ǝ�,�ϑ����ڍŏI�����ʂ̂���������̎�����,�ϑ����ڍŏI�����ʂ̂���������̌���,�ϑ����ڍŏI�����ʂ̂���������̌��O,�ϑ������ʂ̂����ϑ����ԏ�����,�ϑ����ԏ����ʂ̂���������̂��Ǝ�,�ϑ����ԏ����ʂ̂���������̂�������,�ϑ����ԏ����ʂ̂���������n�悪����,�ϑ����ԏ����ʂ̂���������n�悪���O,�ϑ����ԏ����ʂ̂����ϑ����ԏ������,�ϑ����ԏ�����̂����Đ����p��,�ϑ����ԏ�����̂����ŏI������,�Đ����p��,�ŏI������,�ŏI�����ʂ̂���������̂����Ǝ�,�ŏI�����ʂ̂���������̂�������,�ŏI�����ʂ̂���������̂������Ǝ�,���̑���,ػ��ٗ�
,�iA�j,�iB�j,�iC�j,�iD�j,�iE�j,�iE1�j,�iE2�j,�iE3�j,�iE4�j,�iE5�j,�iG�j,�iG1�j,�iG2�j,�iG3�j,�iG4�j,�iG5�j,�iH�j,�iI�j,,,�iK�j,�iO�j,,,,,�iL�j,,,,,�iM�j,�iM1�j,�iM2�j,�iR�j,�iQ�j,�iQ1�j,�iQ2�j,�iQ3�j,�iJ�j,�iS�j
���v,812,8,804,51,43,33,,8,1,1,754,16,,719,19,1,748,,,,747,20,20,,18,2,727,727,0,714,13,709,687,21,736,41,,,41,1,744
�R���k,0,,0,,1,,,,1,0,0,,,0,0,,1,,,,1,1,1,,0,0,0,0,,,0,1,0,0,0,1,,,1,0,0
���D,35,,35,0,0,,,0,,,35,,,34,0,0,35,,,,34,0,0,,0,,34,34,,32,3,29,26,4,26,4,,,4,0,26
���D�̂����L�@�����D,,,,,,,,,,,,,,,,,,,,,,,,,,,,,,,,,,,,,,,,,
���D�̂������@�����D,35,,35,0,0,,,0,,,35,,,34,0,0,35,,,,34,0,0,,0,,34,34,,32,3,29,26,4,26,4,,,4,0,26
�p��,0,,0,,,,,,,,0,,,0,0,,0,,,,0,,,,,,0,0,,0,0,0,0,,0,,,,,,0
�p���̂�����ʔp��,0,,0,,,,,,,,0,,,0,0,,0,,,,0,,,,,,0,0,,0,0,0,0,,0,,,,,,0
�p���̂����p�n��,,,,,,,,,,,,,,,,,,,,,,,,,,,,,,,,,,,,,,,,,
�p���̂������̑�,0,,0,,,,,,,,0,,,0,,,0,,,,0,,,,,,0,0,,0,,,,,,,,,,,
�p�_,,,,,,,,,,,,,,,,,,,,,,,,,,,,,,,,,,,,,,,,,
�p�A���J��,0,,0,,,,,,,,0,,,0,,,0,,,,0,,,,,,0,0,,0,,,,,,,,,,,
�p�v���X�`�b�N��,11,,11,0,,,,,,,11,,,9,2,,11,,,,11,2,2,,2,0,9,9,,7,2,6,3,3,3,5,,,5,,3
�p�v���X�`�b�N�ނ̂����p�v���X�`�b�N,11,,11,0,,,,,,,11,,,9,2,,11,,,,11,2,2,,2,0,9,9,,7,2,6,3,3,3,5,,,5,,3
�p�v���X�`�b�N�ނ̂����p�^�C��,0,,0,,,,,,,,0,,,0,,,0,,,,0,,,,,,0,0,,0,0,0,0,,0,,,,,,0
������,2,,2,,,,,,,,2,,,2,0,,2,,,,2,0,0,,0,,2,2,0,2,0,1,1,0,1,0,,,0,,1
�؂���,67,,67,9,1,,,0,,1,58,0,,56,2,,59,,,,58,2,2,,2,,56,56,0,53,4,49,48,1,48,2,,,2,1,48
�@�ۂ���,0,,0,,,,,,,,0,,,0,,,0,,,,0,,,,,,0,0,,0,0,0,0,,0,,,,,,0
���A�����c��,,,,,,,,,,,,,,,,,,,,,,,,,,,,,,,,,,,,,,,,,
�����n�Ō`�s�v��,,,,,,,,,,,,,,,,,,,,,,,,,,,,,,,,,,,,,,,,,
�S������,,,,,,,,,,,,,,,,,,,,,,,,,,,,,,,,,,,,,,,,,
��������,11,6,4,,,,,,,,4,,,4,0,,4,,,,4,0,0,,0,0,4,4,,4,0,4,4,0,4,0,,,0,,10
�K���X�����킭��,32,2,30,,,,,,,,30,0,,24,5,0,30,,,,30,5,5,,5,1,24,24,0,21,3,24,20,4,20,9,,,9,0,22
�z����,,,,,,,,,,,,,,,,,,,,,,,,,,,,,,,,,,,,,,,,,
���ꂫ��,654,,654,42,42,33,,8,,,612,16,,588,9,,605,,,,605,9,9,,9,0,596,596,0,595,1,594,585,9,634,18,,,18,,634
���ꂫ�ނ̂����R���N���[�g��,413,,413,31,31,30,,1,,,382,4,,374,4,,379,,,,379,4,4,,4,0,375,375,,375,0,375,375,1,409,4,,,4,,409
���ꂫ�ނ̂����p�A�X�t�@���g,196,,196,11,11,3,,7,,,186,11,,175,,,182,,,,182,,,,,,182,182,,182,0,182,182,0,196,0,,,0,,196
���ꂫ�ނ̂������̑�,45,,45,,,,,,,,45,1,,39,5,,44,,,,44,5,5,,5,0,39,39,0,38,1,37,29,9,29,14,,,14,,29
�΂�����,,,,,,,,,,,,,,,,,,,,,,,,,,,,,,,,,,,,,,,,,
�ƒ{�ӂ�A,,,,,,,,,,,,,,,,,,,,,,,,,,,,,,,,,,,,,,,,,
���̑��̎Y�Ɣp����,1,,1,,,,,,,,1,,,0,1,,1,,,,1,1,1,,0,1,0,0,,0,0,0,,0,,1,,,1,,
�P�ʁF�炔/�N,,,,,,,,,,,,,,,,,,,,,,,,,,,,,,,,,,,,,,,,,
