���,������,�L������,�r�o��,���Ȓ��ԏ�����,���Ȓ��ԏ����ʂ̂������Ȓ��ԏ������,���Ȓ��ԏ�����̂����Đ����p��,���Ȓ��ԏ�����̂������ȍŏI������,���Ȓ��ԏ�����̂����ϑ����ԏ�����,���Ȓ��ԏ�����̂����ϑ����ڍŏI������,���Ȓ��ԏ�����̂������̑���,���Ȗ�������,���Ȗ������̂����Đ����p��,���Ȗ������̂������ȍŏI������,���Ȗ������̂����ϑ����ԏ�����,���Ȗ������̂����ϑ����ڍŏI������,���Ȗ������̂������̑���,���o��,���ȍŏI������,������n��̂�������,������n��̂������O,�ϑ�������,�ϑ������ʂ̂����ϑ����ڍŏI������,�ϑ����ڍŏI�����ʂ̂���������̂��Ǝ�,�ϑ����ڍŏI�����ʂ̂���������̎�����,�ϑ����ڍŏI�����ʂ̂���������̌���,�ϑ����ڍŏI�����ʂ̂���������̌��O,�ϑ������ʂ̂����ϑ����ԏ�����,�ϑ����ԏ����ʂ̂���������̂��Ǝ�,�ϑ����ԏ����ʂ̂���������̂�������,�ϑ����ԏ����ʂ̂���������n�悪����,�ϑ����ԏ����ʂ̂���������n�悪���O,�ϑ����ԏ����ʂ̂����ϑ����ԏ������,�ϑ����ԏ�����̂����Đ����p��,�ϑ����ԏ�����̂����ŏI������,�Đ����p��,�ŏI������,�ŏI�����ʂ̂���������̂����Ǝ�,�ŏI�����ʂ̂���������̂�������,�ŏI�����ʂ̂���������̂������Ǝ�,���̑���,ػ��ٗ�
,�iA�j,�iB�j,�iC�j,�iD�j,�iE�j,�iE1�j,�iE2�j,�iE3�j,�iE4�j,�iE5�j,�iG�j,�iG1�j,�iG2�j,�iG3�j,�iG4�j,�iG5�j,�iH�j,�iI�j,,,�iK�j,�iO�j,,,,,�iL�j,,,,,�iM�j,�iM1�j,�iM2�j,�iR�j,�iQ�j,�iQ1�j,�iQ2�j,�iQ3�j,�iJ�j,�iS�j
���v,740,18,722,528,21,9,0,9,3,0,194,4,,186,4,0,202,0,0,,202,8,8,0,5,3,195,194,0,107,88,137,122,14,135,22,0,0,22,0,153
�R���k,23,,23,,3,0,0,1,2,0,23,,,23,0,,26,0,0,,26,3,3,,2,0,24,24,,12,12,27,25,2,25,5,0,,5,0,25
���D,322,0,322,300,16,8,,7,1,,22,,,20,2,,30,,,,30,3,3,,1,1,27,27,,11,16,17,15,2,23,5,,,5,,23
���D�̂����L�@�����D,246,0,246,239,1,,,1,0,,6,,,6,0,,8,,,,8,1,1,,0,0,7,7,,3,4,5,4,0,4,1,,,1,,4
���D�̂������@�����D,76,0,76,61,14,8,,6,1,,15,,,14,2,,22,,,,22,2,2,,1,1,20,20,,8,12,13,11,2,19,4,,,4,,19
�p��,30,0,29,4,,,,,,,25,0,,25,,0,25,,,,25,,,,,,25,25,,8,16,5,5,,5,,,,,0,6
�p���̂�����ʔp��,9,0,9,,,,,,,,9,,,9,,0,9,,,,9,,,,,,9,9,,2,6,2,2,,2,,,,,0,2
�p���̂����p�n��,8,0,8,4,,,,,,,4,,,4,,,4,,,,4,,,,,,4,4,,2,1,0,0,,0,,,,,,1
�p���̂������̑�,13,0,13,0,,,,,,,13,0,,13,,0,13,,,,13,,,,,,13,13,,4,9,3,3,,3,,,,,0,3
�p�_,17,0,17,0,,,,,,,17,,,17,0,,17,,,,17,,,,,,17,17,,5,11,8,8,,8,,,,,,8
�p�A���J��,19,0,19,0,0,,,,,0,19,,,19,,,19,,,,19,,,,,,19,19,,5,13,5,5,,5,,,,,0,5
�p�v���X�`�b�N��,149,5,144,108,0,0,,0,,,37,1,,35,1,,36,,,,36,1,1,0,1,0,35,35,0,26,9,25,21,4,23,4,,0,4,,27
�p�v���X�`�b�N�ނ̂����p�v���X�`�b�N,149,5,144,108,0,0,,0,,,37,1,,35,1,,36,,,,36,1,1,0,1,0,35,35,0,26,9,25,21,4,23,4,,0,4,,27
�p�v���X�`�b�N�ނ̂����p�^�C��,0,,0,,,,,,,,0,,,0,,,0,,,,0,,,,,,0,0,,0,,0,,0,,0,,,0,,
������,110,0,110,106,,,,,,,4,3,,1,,,1,,,,1,,,,,,1,1,,1,0,1,1,0,4,0,,,0,,4
�؂���,9,,9,8,,,,,,,0,,,0,,0,0,,,,0,,,,,,0,0,,0,0,0,0,0,0,0,,,0,0,0
�@�ۂ���,1,0,1,,,,,,,,1,,,1,,,1,,,,1,,,,,,1,1,,1,0,1,1,,1,,,,,,1
���A�����c��,4,1,3,,,,,,,,3,,,3,0,,3,,,,3,0,0,,0,,3,3,,3,0,3,3,,3,0,,,0,,4
�����n�Ō`�s�v��,,,,,,,,,,,,,,,,,,,,,,,,,,,,,,,,,,,,,,,,,
�S������,0,,0,,,,,,,,0,,,0,,,0,,,,0,,,,,,0,0,0,0,0,0,0,,0,,,,,,0
��������,28,12,17,,,,,,,,17,,,17,0,,17,,,,17,0,0,0,0,,17,17,0,14,2,17,17,0,17,0,,0,0,,28
�K���X�����킭��,17,0,17,1,1,0,,1,,,16,,,16,0,,16,,,,16,0,0,0,0,0,16,16,0,16,1,16,13,4,13,4,,0,4,,13
�z����,7,,7,,,,,,,,7,,,6,1,,7,,,,7,1,1,,,1,6,6,,,6,6,6,,6,1,,,1,,6
���ꂫ��,4,,4,1,1,1,,,,,3,,,3,0,,3,,,,3,0,0,,0,0,3,3,0,3,0,2,0,2,1,3,,,3,,1
���ꂫ�ނ̂����R���N���[�g��,3,,3,1,1,1,,,,,2,,,2,0,,2,,,,2,0,0,,0,,2,2,,2,0,2,,2,1,2,,,2,,1
���ꂫ�ނ̂����p�A�X�t�@���g,,,,,,,,,,,,,,,,,,,,,,,,,,,,,,,,,,,,,,,,,
���ꂫ�ނ̂������̑�,1,,1,,,,,,,,1,,,0,0,,1,,,,1,0,0,,,0,0,0,0,0,,0,0,0,0,0,,,0,,0
�΂�����,1,,1,,,,,,,,1,,,1,0,,1,,,,1,0,0,,0,0,1,1,,,1,1,1,0,1,0,,,0,,1
�ƒ{�ӂ�A,,,,,,,,,,,,,,,,,,,,,,,,,,,,,,,,,,,,,,,,,
���̑��̎Y�Ɣp����,0,,0,,,,,,,,0,,,,0,,0,,,,0,0,0,,,0,,,,,,,,,,0,,,0,,
�P�ʁF�炔/�N,,,,,,,,,,,,,,,,,,,,,,,,,,,,,,,,,,,,,,,,,
