﻿,全国地方公共団体コド,都道府県名,,公表_年月日,発症_年月日,患者_居住地,患者_年代,患者_性別,患者_職業,患者_状態,患者_症状,患者_渡航歴の有無フラグ
1,180009,福井県,,2020/3/18,2020/3/12,福井市,50代,男性,,,,0
2,180009,福井県,,2020/3/25,2020/3/16,福井市,40代,男性,,,,0
3,180009,福井県,,2020/3/25,2020/3/21,福井市,70代,男性,,,,0
4,180009,福井県,,2020/3/26,2020/3/24,福井市,70代,女性,,,,0
5,180009,福井県,,2020/3/26,2020/3/25,福井市,40代,男性,,,,0
6,180009,福井県,,2020/3/26,,福井市,10代,女性,,,,0
7,180009,福井県,,2020/3/27,2020/3/21,越前市,50代,男性,,,,0
8,180009,福井県,,2020/3/27,2020/3/22,福井市,50代,男性,,,,0
9,180009,福井県,,2020/3/27,2020/3/22,越前市,50代,男性,,,,0
10,180009,福井県,,2020/3/28,2020/3/21,福井市,50代,男性,,,,0
11,180009,福井県,,2020/3/28,2020/3/22,福井市,60代,男性,,,,0
12,180009,福井県,,2020/3/28,2020/3/22,越前市,50代,男性,,,,0
13,180009,福井県,,2020/3/29,2020/3/26,鯖江市,40代,女性,,,,0
14,180009,福井県,,2020/3/30,2020/3/27,福井市,40代,男性,,,,0
15,180009,福井県,,2020/3/30,2020/3/27,越前市,30代,女性,,,,0
16,180009,福井県,,2020/3/31,2020/3/18,福井市,30代,女性,,,,0
17,180009,福井県,,2020/3/31,2020/3/27,福井市,20代,男性,,,,0
18,180009,福井県,,2020/3/31,2020/3/22,坂井市,60代,男性,,,,0
19,180009,福井県,,2020/3/31,2020/3/27,南越前町,60代,女性,,,,0
20,180009,福井県,,2020/3/31,2020/3/22,福井市,40代,男性,,,,0
21,180009,福井県,,2020/4/1,2020/3/26,あわら市,50代,男性,,,,0
22,180009,福井県,,2020/4/2,2020/3/26,福井市,50代,男性,,,,0
23,180009,福井県,,2020/4/2,2020/3/26,福井市,60代,男性,,,,0
24,180009,福井県,,2020/4/2,2020/3/27,福井市,60代,男性,,,,0
25,180009,福井県,,2020/4/2,2020/3/23,越前市,50代,男性,,,,0
26,180009,福井県,,2020/4/2,2020/3/24,福井市,20代,女性,,,,0
27,180009,福井県,,2020/4/2,2020/3/29,福井市,50代,女性,,,,0
28,180009,福井県,,2020/4/2,2020/3/27,福井市,50代,男性,,,,0
29,180009,福井県,,2020/4/2,2020/3/29,福井市,70代,男性,,,,0
30,180009,福井県,,2020/4/2,2020/3/22,福井市,70代,男性,,,,0
31,180009,福井県,,2020/4/3,2020/4/1,福井市,80代,女性,,,,0
32,180009,福井県,,2020/4/3,2020/3/28,福井市,90代,女性,,,,0
33,180009,福井県,,2020/4/3,2020/3/20,福井市,60代,男性,,,,0
34,180009,福井県,,2020/4/3,2020/3/27,越前市,10歳未満,男性,,,,0
35,180009,福井県,,2020/4/3,2020/3/25,越前市,50代,男性,,,,0
36,180009,福井県,,2020/4/3,2020/3/27,福井市,70代,男性,,,,0
37,180009,福井県,,2020/4/3,2020/3/28,福井市,50代,男性,,,,0
38,180009,福井県,,2020/4/3,2020/3/30,福井市,30代,男性,,,,0
39,180009,福井県,,2020/4/3,2020/4/1,福井市,40代,男性,,,,0
40,180009,福井県,,2020/4/3,2020/3/31,越前市,70代,女性,,,,0
41,180009,福井県,,2020/4/3,2020/3/29,越前市,50代,女性,,,,0
42,180009,福井県,,2020/4/3,2020/3/27,福井市,50代,女性,,,,0
43,180009,福井県,,2020/4/4,2020/3/30,鯖江市,80代,女性,,,,0
44,180009,福井県,,2020/4/4,2020/4/1,鯖江市,30代,女性,,,,0
45,180009,福井県,,2020/4/4,2020/3/29,越前市,30代,男性,,,,0
46,180009,福井県,,2020/4/4,2020/3/24,福井市,40代,男性,,,,0
47,180009,福井県,,2020/4/5,2020/4/3,越前市,20代,男性,,,,0
48,180009,福井県,,2020/4/5,2020/4/2,鯖江市,50代,男性,,,,0
49,180009,福井県,,2020/4/5,2020/4/2,福井市,70代,男性,,,,0
50,180009,福井県,,2020/4/5,2020/3/24,坂井市,50代,女性,,,,0
51,180009,福井県,,2020/4/5,2020/3/27,越前市,50代,男性,,,,0
52,180009,福井県,,2020/4/5,2020/4/1,福井市,40代,男性,,,,0
53,180009,福井県,,2020/4/5,2020/3/26,福井市,70代,女性,,,,0
54,180009,福井県,,2020/4/6,2020/3/31,鯖江市,50代,女性,,,,0
55,180009,福井県,,2020/4/6,2020/3/30,福井市,50代,女性,,,,0
56,180009,福井県,,2020/4/6,2020/3/31,大野市,50代,男性,,,,0
57,180009,福井県,,2020/4/6,2020/4/3,大野市,40代,男性,,,,0
58,180009,福井県,,2020/4/6,2020/4/1,大野市,50代,男性,,,,0
59,180009,福井県,,2020/4/6,2020/3/28,越前市,50代,女性,,,,0
60,180009,福井県,,2020/4/7,2020/4/2,大野市,40代,女性,,,,0
61,180009,福井県,,2020/4/7,2020/4/4,大野市,70代,女性,,,,0
62,180009,福井県,,2020/4/7,2020/4/5,福井市,70代,男性,,,,0
63,180009,福井県,,2020/4/7,2020/4/3,福井市,50代,男性,,,,0
64,180009,福井県,,2020/4/7,2020/4/3,福井市,50代,女性,,,,0
65,180009,福井県,,2020/4/7,2020/3/25,越前市,50代,女性,,,,0
66,180009,福井県,,2020/4/8,2020/3/28,福井市,30代,女性,,,,0
67,180009,福井県,,2020/4/8,2020/4/3,永平寺町,50代,男性,,,,0
68,180009,福井県,,2020/4/8,2020/3/29,坂井市,50代,男性,,,,0
69,180009,福井県,,2020/4/8,2020/4/4,鯖江市,80代,男性,,,,0
70,180009,福井県,,2020/4/8,2020/4/4,福井市,50代,男性,,,,0
71,180009,福井県,,2020/4/8,2020/4/3,福井市,80代,男性,,,,0
72,180009,福井県,,2020/4/8,2020/4/1,坂井市,60代,男性,,,,0
73,180009,福井県,,2020/4/9,,福井市,60代,男性,,,,0
74,180009,福井県,,2020/4/9,2020/4/2,福井市,20代,男性,,,,0
75,180009,福井県,,2020/4/9,2020/4/4,福井市,30代,女性,,,,0
76,180009,福井県,,2020/4/9,2020/3/29,福井市,60代,男性,,,,0
77,180009,福井県,,2020/4/9,2020/4/5,福井市,60代,男性,,,,0
78,180009,福井県,,2020/4/10,,越前市,10歳未満,男性,,,,0
79,180009,福井県,,2020/4/10,2020/4/8,福井市,60代,男性,,,,0
80,180009,福井県,,2020/4/10,2020/4/4,福井市,50代,男性,,,,0
81,180009,福井県,,2020/4/10,2020/4/5,福井市,80代,女性,,,,0
82,180009,福井県,,2020/4/10,,福井市,60代,男性,,,,0
83,180009,福井県,,2020/4/11,2020/4/2,福井市,50代,女性,,,,0
84,180009,福井県,,2020/4/11,2020/4/1,福井市,70代,女性,,,,0
85,180009,福井県,,2020/4/11,2020/3/27,福井市,60代,男性,,,,0
86,180009,福井県,,2020/4/11,2020/4/7,福井市,40代,男性,,,,0
87,180009,福井県,,2020/4/12,2020/4/6,越前市,40代,女性,,,,0
88,180009,福井県,,2020/4/12,2020/3/28,福井市,60代,男性,,,,0
89,180009,福井県,,2020/4/13,2020/4/8,坂井市,60代,男性,,,,0
90,180009,福井県,,2020/4/13,2020/4/10,福井市,60代,男性,,,,0
91,180009,福井県,,2020/4/13,2020/4/5,鯖江市,30代,女性,,,,0
92,180009,福井県,,2020/4/13,2020/4/8,坂井市,40代,女性,,,,0
93,180009,福井県,,2020/4/15,2020/4/11,坂井市,70代,男性,,,,0
94,180009,福井県,,2020/4/15,2020/4/9,坂井市,50代,男性,,,,0
95,180009,福井県,,2020/4/15,2020/4/3,福井市,70代,女性,,,,0
96,180009,福井県,,2020/4/15,,福井市,70代,女性,,,,0
97,180009,福井県,,2020/4/15,2020/4/9,福井市,30代,男性,,,,0
98,180009,福井県,,2020/4/15,,福井市,50代,女性,,,,0
99,180009,福井県,,2020/4/15,2020/4/11,大野市,50代,男性,,,,0
100,180009,福井県,,2020/4/15,2020/4/11,福井市,70代,女性,,,,0
101,180009,福井県,,2020/4/16,2020/4/10,福井市,30代,男性,,,,0
102,180009,福井県,,2020/4/16,,福井市,60代,女性,,,,0
103,180009,福井県,,2020/4/16,2020/4/14,福井市,40代,男性,,,,0
104,180009,福井県,,2020/4/17,2020/4/9,福井市,50代,女性,,,,0
105,180009,福井県,,2020/4/18,2020/4/12,若狭町,30代,女性,,,,0
106,180009,福井県,,2020/4/18,2020/4/16,福井市,40代,男性,,,,0
107,180009,福井県,,2020/4/19,2020/3/23,福井市,20代,女性,,,,0
108,180009,福井県,,2020/4/19,2020/4/15,福井市,40代,男性,,,,0
109,180009,福井県,,2020/4/19,2020/4/3,福井市,70代,女性,,,,0
110,180009,福井県,,2020/4/19,2020/4/13,福井市,50代,男性,,,,0
111,180009,福井県,,2020/4/19,2020/4/3,福井市,20代,男性,,,,0
112,180009,福井県,,2020/4/19,2020/4/14,福井市,10代,女性,,,,0
113,180009,福井県,,2020/4/20,2020/4/13,福井市,40代,女性,,,,0
114,180009,福井県,,2020/4/21,2020/4/10,福井市,70代,女性,,,,0
115,180009,福井県,,2020/4/21,2020/4/14,越前市,20代,男性,,,,0
116,180009,福井県,,2020/4/21,2020/4/12,坂井市,60代,女性,,,,0
117,180009,福井県,,2020/4/21,2020/4/16,坂井市,30代,男性,,,,0
118,180009,福井県,,2020/4/21,2020/4/16,福井市,70代,男性,,,,0
119,180009,福井県,,2020/4/22,2020/4/19,越前市,20代,女性,,,,0
120,180009,福井県,,2020/4/24,,福井市,60代,女性,,,,0
121,180009,福井県,,2020/4/26,,福井市,70代,男性,,,,0
122,180009,福井県,,2020/4/28,2020/4/24,福井市,30代,女性,,,,0
123,180009,福井県,,2020/7/12,2020/7/10,福井市,30代,男性,,,,0
124,180009,福井県,,2020/7/13,2020/7/12,福井市,20代,女性,,,,0
125,180009,福井県,,2020/7/15,,福井市,10歳未満,女性,,,,0
126,180009,福井県,,2020/7/17,2020/7/11,坂井市,50代,男性,,,,0
127,180009,福井県,,2020/7/23,2020/7/21,坂井市,20代,男性,,,,0
128,180009,福井県,,2020/7/26,2020/7/25,坂井市,30代,女性,,,,0
129,180009,福井県,,2020/7/26,2020/7/17,福井市,20代,女性,,,,0
130,180009,福井県,,2020/7/29,2020/7/26,福井市,50代,男性,,,,0
131,180009,福井県,,2020/7/29,2020/7/27,福井市,30代,男性,,,,0
132,180009,福井県,,2020/7/29,2020/7/27,坂井市,40代,男性,,,,0
133,180009,福井県,,2020/7/29,2020/7/27,坂井市,50代,男性,,,,0
134,180009,福井県,,2020/7/29,,福井市,30代,男性,,,,0
135,180009,福井県,,2020/7/29,2020/7/27,福井市,40代,男性,,,,0
136,180009,福井県,,2020/7/30,,福井市,20代,男性,,,,0
137,180009,福井県,,2020/7/30,,福井市,80代,女性,,,,0
138,180009,福井県,,2020/7/31,2020/7/26,越前市,20代,男性,,,,0
139,180009,福井県,,2020/7/31,2020/7/29,敦賀市,20代,男性,,,,0
140,180009,福井県,,2020/8/2,2020/7/30,坂井市,10代,男性,,,,0
141,180009,福井県,,2020/8/3,2020/7/27,敦賀市,50代,女性,,,,0
142,180009,福井県,,2020/8/3,2020/8/2,あわら市,20代,男性,,,,0
143,180009,福井県,,2020/8/4,2020/8/2,越前市,40代,男性,,,,0
144,180009,福井県,,2020/8/4,,坂井市,70代,女性,,,,0
145,180009,福井県,,2020/8/4,,敦賀市,60代,男性,,,,0
146,180009,福井県,,2020/8/5,2020/7/30,鯖江市,20代,男性,,,,0
147,180009,福井県,,2020/8/5,,敦賀市,60代,女性,,,,0
148,180009,福井県,,2020/8/5,,福井市,40代,女性,,,,0
149,180009,福井県,,2020/8/5,2020/8/3,鯖江市,20代,女性,,,,0
150,180009,福井県,,2020/8/6,,福井市,30代,男性,,,,0
151,180009,福井県,,2020/8/6,,坂井市,70代,男性,,,,0
152,180009,福井県,,2020/8/6,2020/8/5,三重県,20代,男性,,,,0
153,180009,福井県,,2020/8/7,,敦賀市,60代,女性,,,,0
154,180009,福井県,,2020/8/9,2020/8/6,福井市,80代,男性,,,,0
155,180009,福井県,,2020/8/16,2020/8/15,福井市,50代,女性,,,,0
156,180009,福井県,,2020/8/20,2020/8/18,美浜町,50代,男性,,,,0
157,180009,福井県,,2020/8/21,2020/8/20,あわら市,60代,女性,,,,0
158,180009,福井県,,2020/8/22,,坂井市,20代,女性,,,,0
159,180009,福井県,,2020/8/22,2020/8/20,あわら市,70代,男性,,,,0
160,180009,福井県,,2020/8/22,2020/8/9,あわら市,30代,男性,,,,0
161,180009,福井県,,2020/8/22,2020/8/8,あわら市,30代,女性,,,,0
162,180009,福井県,,2020/8/23,2020/8/17,鯖江市,70代,男性,,,,0
163,180009,福井県,,2020/8/23,2020/8/14,福井市,70代,男性,,,,0
164,180009,福井県,,2020/8/24,2020/8/18,坂井市,20代,女性,,,,0
165,180009,福井県,,2020/8/25,2020/8/21,福井市,70代,男性,,,,0
166,180009,福井県,,2020/8/25,2020/8/21,福井市,70代,女性,,,,0
167,180009,福井県,,2020/8/25,2020/8/16,福井市,70代,女性,,,,0
168,180009,福井県,,2020/8/25,2020/8/22,福井市,40代,男性,,,,0
169,180009,福井県,,2020/8/25,2020/8/23,福井市,40代,男性,,,,0
170,180009,福井県,,2020/8/25,,福井市,50代,女性,,,,0
171,180009,福井県,,2020/8/25,2020/8/19,福井市,80代,男性,,,,0
172,180009,福井県,,2020/8/26,2020/8/18,鯖江市,30代,女性,,,,0
173,180009,福井県,,2020/8/26,2020/8/24,福井市,30代,男性,,,,0
174,180009,福井県,,2020/8/26,2020/8/18,福井市,80代,男性,,,,0
175,180009,福井県,,2020/8/26,2020/8/24,福井市,80代,男性,,,,0
176,180009,福井県,,2020/8/26,2020/8/23,福井市,80代,女性,,,,0
177,180009,福井県,,2020/8/26,,福井市,70代,女性,,,,0
178,180009,福井県,,2020/8/27,2020/8/25,越前町,50代,男性,,,,0
179,180009,福井県,,2020/8/27,2020/8/22,福井市,80代,女性,,,,0
180,180009,福井県,,2020/8/27,2020/8/23,坂井市,40代,男性,,,,0
181,180009,福井県,,2020/8/27,2020/8/22,福井市,70代,男性,,,,0
182,180009,福井県,,2020/8/27,2020/8/26,福井市,60代,男性,,,,0
183,180009,福井県,,2020/8/27,2020/8/23,福井市,70代,男性,,,,0
184,180009,福井県,,2020/8/27,2020/8/24,鯖江市,70代,男性,,,,0
185,180009,福井県,,2020/8/27,2020/8/24,福井市,70代,女性,,,,0
186,180009,福井県,,2020/8/27,2020/8/24,越前市,80代,男性,,,,0
187,180009,福井県,,2020/8/27,2020/8/22,越前市,70代,女性,,,,0
188,180009,福井県,,2020/8/27,2020/8/24,福井市,80代,女性,,,,0
189,180009,福井県,,2020/8/27,,福井市,80代,女性,,,,0
190,180009,福井県,,2020/8/27,2020/8/26,福井市,70代,男性,,,,0
191,180009,福井県,,2020/8/28,2020/8/24,越前町,70代,男性,,,,0
192,180009,福井県,,2020/8/28,,福井市,70代,女性,,,,0
193,180009,福井県,,2020/8/28,2020/8/21,越前町,70代,男性,,,,0
194,180009,福井県,,2020/8/28,2020/8/24,越前町,70代,女性,,,,0
195,180009,福井県,,2020/8/28,2020/8/23,福井市,70代,女性,,,,0
196,180009,福井県,,2020/8/28,2020/8/27,越前市,30代,女性,,,,0
197,180009,福井県,,2020/8/28,2020/8/24,福井市,60代,男性,,,,0
198,180009,福井県,,2020/8/28,,福井市,70代,女性,,,,0
199,180009,福井県,,2020/8/28,2020/8/23,福井市,80代,男性,,,,0
200,180009,福井県,,2020/8/28,2020/8/27,福井市,60代,女性,,,,0
201,180009,福井県,,2020/8/28,,福井市,70代,男性,,,,0
202,180009,福井県,,2020/8/28,2020/8/25,福井市,40代,女性,,,,0
203,180009,福井県,,2020/8/28,,福井市,70代,女性,,,,0
204,180009,福井県,,2020/8/28,2020/8/25,越前市,60代,女性,,,,0
205,180009,福井県,,2020/8/28,,福井市,50代,女性,,,,0
206,180009,福井県,,2020/8/28,2020/8/24,越前町,70代,女性,,,,0
207,180009,福井県,,2020/8/29,2020/8/26,福井市,70代,男性,,,,0
208,180009,福井県,,2020/8/29,2020/8/28,福井市,70代,男性,,,,0
209,180009,福井県,,2020/8/29,,福井市,70代,男性,,,,0
210,180009,福井県,,2020/8/29,,福井市,70代,女性,,,,0
211,180009,福井県,,2020/8/29,,鯖江市,70代,男性,,,,0
212,180009,福井県,,2020/8/30,,福井市,70代,男性,,,,0
213,180009,福井県,,2020/8/30,,福井市,70代,女性,,,,0
214,180009,福井県,,2020/8/30,,福井市,40代,女性,,,,0
215,180009,福井県,,2020/8/30,,福井市,10代,女性,,,,0
216,180009,福井県,,2020/8/30,,福井市,70代,女性,,,,0
217,180009,福井県,,2020/8/30,2020/8/25,鯖江市,30代,男性,,,,0
218,180009,福井県,,2020/8/30,2020/8/26,鯖江市,20代,女性,,,,0
219,180009,福井県,,2020/8/30,,福井市,70代,女性,,,,0
220,180009,福井県,,2020/8/30,2020/8/26,越前町,70代,男性,,,,0
221,180009,福井県,,2020/8/30,2020/8/27,越前町,70代,女性,,,,0
222,180009,福井県,,2020/8/30,2020/8/25,越前市,80代,男性,,,,0
223,180009,福井県,,2020/8/31,2020/8/24,鯖江市,60代,女性,,,,0
224,180009,福井県,,2020/8/31,2020/8/28,福井市,10代,男性,,,,0
225,180009,福井県,,2020/8/31,2020/8/29,福井市,20代,男性,,,,0
226,180009,福井県,,2020/8/31,2020/8/25,福井市,80代,女性,,,,0
227,180009,福井県,,2020/8/31,,福井市,70代,女性,,,,0
228,180009,福井県,,2020/8/31,,鯖江市,70代,女性,,,,0
229,180009,福井県,,2020/9/1,,福井市,80代,男性,,,,0
230,180009,福井県,,2020/9/1,2020/8/29,福井市,50代,男性,,,,0
231,180009,福井県,,2020/9/1,,鯖江市,50代,女性,,,,0
232,180009,福井県,,2020/9/1,2020/8/24,越前市,70代,男性,,,,0
233,180009,福井県,,2020/9/2,2020/8/23,越前町,70代,男性,,,,0
234,180009,福井県,,2020/9/2,2020/8/23,越前市,80代,男性,,,,0
235,180009,福井県,,2020/9/2,2020/8/27,越前市,80代,女性,,,,0
236,180009,福井県,,2020/9/2,,鯖江市,70代,男性,,,,0
237,180009,福井県,,2020/9/3,,鯖江市,70代,女性,,,,0
238,180009,福井県,,2020/9/3,2020/8/31,南越前町,70代,男性,,,,0
239,180009,福井県,,2020/9/4,2020/8/29,福井市,80代,男性,,,,0
240,180009,福井県,,2020/9/4,,福井市,80代,女性,,,,0
241,180009,福井県,,2020/9/4,,福井市,50代,女性,,,,0
242,180009,福井県,,2020/9/5,2020/9/3,敦賀市,50代,男性,,,,0
243,180009,福井県,,2020/9/5,2020/8/30,福井市,90代,女性,,,,0
244,180009,福井県,,2020/9/8,2020/9/4,鯖江市,90代,女性,,,,0
245,180009,福井県,,2020/10/6,2020/9/30,敦賀市,40代,男性,,,,0
246,180009,福井県,,2020/10/6,2020/10/3,敦賀市,40代,女性,,,,0
247,180009,福井県,,2020/10/7,,若狭町,40代,男性,,,,0
248,180009,福井県,,2020/10/8,2020/9/30,坂井市,20代,女性,,,,0
249,180009,福井県,,2020/10/9,2020/10/6,鯖江市,40代,男性,,,,0
250,180009,福井県,,2020/10/15,2020/10/8,福井市,50代,男性,,,,0
251,180009,福井県,,2020/10/16,2020/10/14,小浜市,50代,女性,,,,0
252,180009,福井県,,2020/10/16,,小浜市,60代,男性,,,,0
253,180009,福井県,,2020/10/16,2020/10/10,小浜市,60代,女性,,,,0
254,180009,福井県,,2020/10/16,2020/10/12,小浜市,70代,女性,,,,0
255,180009,福井県,,2020/10/18,2020/10/1,高浜町,40代,女性,,,,0
256,180009,福井県,,2020/10/18,2020/10/11,高浜町,10代,男性,,,,0
257,180009,福井県,,2020/10/31,2020/10/23,福井市,60代,男性,,,,0
258,180009,福井県,,2020/11/7,2020/11/2,越前町,60代,男性,,,,0
259,180009,福井県,,2020/11/8,2020/11/1,敦賀市,50代,男性,,,,0
260,180009,福井県,,2020/11/9,2020/11/3,福井市,30代,男性,,,,0
261,180009,福井県,,2020/11/9,2020/11/8,福井市,10代,男性,,,,0
262,180009,福井県,,2020/11/9,2020/11/9,福井市,10代,男性,,,,0
263,180009,福井県,,2020/11/10,2020/11/4,福井市,20代,男性,,,,0
264,180009,福井県,,2020/11/10,,鯖江市,10代,女性,,,,0
265,180009,福井県,,2020/11/10,2020/11/7,あわら市,30代,男性,,,,0
266,180009,福井県,,2020/11/10,2020/11/9,福井市,20代,女性,,,,0
267,180009,福井県,,2020/11/11,,あわら市,20代,女性,,,,0
268,180009,福井県,,2020/11/11,,越前市,10代,女性,,,,0
269,180009,福井県,,2020/11/12,2020/11/10,福井市,40代,男性,,,,0
270,180009,福井県,,2020/11/13,2020/11/9,坂井市,10代,女性,,,,0
271,180009,福井県,,2020/11/13,,坂井市,10代,女性,,,,0
272,180009,福井県,,2020/11/14,2020/11/9,福井市,20代,女性,,,,0
273,180009,福井県,,2020/11/16,,敦賀市,60代,男性,,,,0
274,180009,福井県,,2020/11/16,2020/11/12,大阪府,30代,男性,,,,0
275,180009,福井県,,2020/11/17,2020/11/14,敦賀市,60代,男性,,,,0
276,180009,福井県,,2020/11/17,2020/11/14,敦賀市,30代,男性,,,,0
277,180009,福井県,,2020/11/17,2020/11/12,敦賀市,60代,男性,,,,0
278,180009,福井県,,2020/11/17,2020/11/14,福井市,70代,女性,,,,0
279,180009,福井県,,2020/11/18,2020/11/15,福井市,10代,男性,,,,0
280,180009,福井県,,2020/11/18,,敦賀市,50代,女性,,,,0
281,180009,福井県,,2020/11/18,,敦賀市,50代,女性,,,,0
282,180009,福井県,,2020/11/18,2020/11/16,敦賀市,20代,女性,,,,0
283,180009,福井県,,2020/11/18,,敦賀市,20代,女性,,,,0
284,180009,福井県,,2020/11/18,2020/11/17,福井市,60代,男性,,,,0
285,180009,福井県,,2020/11/18,,福井市,80代,女性,,,,0
286,180009,福井県,,2020/11/18,2020/11/14,福井市,50代,女性,,,,0
287,180009,福井県,,2020/11/18,2020/11/14,敦賀市,40代,男性,,,,0
288,180009,福井県,,2020/11/18,2020/11/8,敦賀市,40代,男性,,,,0
289,180009,福井県,,2020/11/18,,敦賀市,30代,男性,,,,0
290,180009,福井県,,2020/11/19,2020/11/12,福井市,10代,男性,,,,0
291,180009,福井県,,2020/11/19,2020/11/15,鯖江市,20代,男性,,,,0
292,180009,福井県,,2020/11/19,2020/11/11,福井市,40代,女性,,,,0
293,180009,福井県,,2020/11/19,2020/11/15,福井市,60代,女性,,,,0
294,180009,福井県,,2020/11/19,2020/11/17,福井市,20代,男性,,,,0
295,180009,福井県,,2020/11/19,2020/11/14,永平寺町,20代,女性,,,,0
296,180009,福井県,,2020/11/20,2020/11/18,福井市,20代,男性,,,,0
297,180009,福井県,,2020/11/20,,永平寺町,30代,女性,,,,0
298,180009,福井県,,2020/11/20,,鯖江市,60代,女性,,,,0
299,180009,福井県,,2020/11/21,2020/11/18,福井市,60代,女性,,,,0
300,180009,福井県,,2020/11/21,2020/11/18,福井市,50代,男性,,,,0
301,180009,福井県,,2020/11/22,2020/11/20,福井市,10代,女性,,,,0
302,180009,福井県,,2020/11/22,2020/11/19,福井市,70代,女性,,,,0
303,180009,福井県,,2020/11/23,,福井市,10代,女性,,,,0
304,180009,福井県,,2020/11/24,,福井市,40代,男性,,,,0
305,180009,福井県,,2020/11/25,2020/11/25,鯖江市,50代,男性,,,,0
306,180009,福井県,,2020/11/26,,福井市,30代,男性,,,,0
307,180009,福井県,,2020/11/26,2020/11/24,福井市,40代,男性,,,,0
308,180009,福井県,,2020/11/26,,越前町,40代,女性,,,,0
309,180009,福井県,,2020/11/26,2020/11/24,福井市,40代,女性,,,,0
310,180009,福井県,,2020/11/27,2020/11/24,坂井市,20代,男性,,,,0
311,180009,福井県,,2020/11/27,2020/11/26,福井市,70代,女性,,,,0
312,180009,福井県,,2020/11/27,,坂井市,60代,男性,,,,0
313,180009,福井県,,2020/11/28,2020/11/25,福井市,70代,男性,,,,0
314,180009,福井県,,2020/11/28,,越前町,80代,男性,,,,0
315,180009,福井県,,2020/11/30,2020/11/26,福井市,60代,男性,,,,0
316,180009,福井県,,2020/11/30,2020/11/28,坂井市,40代,女性,,,,0
317,180009,福井県,,2020/12/1,2020/11/29,福井市,30代,女性,,,,0
318,180009,福井県,,2020/12/1,2020/11/29,福井市,50代,女性,,,,0
319,180009,福井県,,2020/12/1,2020/11/29,福井市,70代,女性,,,,0
320,180009,福井県,,2020/12/3,2020/11/29,神奈川県,40代,男性,,,,0
321,180009,福井県,,2020/12/4,2020/12/1,永平寺町,40代,男性,,,,0
322,180009,福井県,,2020/12/7,2020/12/4,敦賀市,20代,女性,,,,0
323,180009,福井県,,2020/12/8,,敦賀市,20代,女性,,,,0
324,180009,福井県,,2020/12/8,2020/12/6,福井市,40代,男性,,,,0
325,180009,福井県,,2020/12/8,2020/12/4,福井市,80代,男性,,,,0
326,180009,福井県,,2020/12/8,2020/12/4,敦賀市,40代,女性,,,,0
327,180009,福井県,,2020/12/9,2020/12/7,福井市,70代,女性,,,,0
328,180009,福井県,,2020/12/9,,敦賀市,50代,女性,,,,0
329,180009,福井県,,2020/12/9,,敦賀市,30代,女性,,,,0
330,180009,福井県,,2020/12/10,2020/12/4,福井市,40代,男性,,,,0
331,180009,福井県,,2020/12/10,2020/12/7,坂井市,60代,男性,,,,0
332,180009,福井県,,2020/12/13,2020/12/6,福井市,70代,男性,,,,0
333,180009,福井県,,2020/12/15,2020/12/10,福井市,50代,男性,,,,0
334,180009,福井県,,2020/12/16,2020/12/14,福井市,20代,男性,,,,0
335,180009,福井県,,2020/12/16,2020/12/14,福井市,20代,男性,,,,0
336,180009,福井県,,2020/12/16,,福井市,40代,男性,,,,0
337,180009,福井県,,2020/12/16,,福井市,10代,男性,,,,0
338,180009,福井県,,2020/12/23,2020/12/21,敦賀市,20代,男性,,,,0
339,180009,福井県,,2020/12/24,,敦賀市,50代,女性,,,,0
340,180009,福井県,,2020/12/25,,高浜町,50代,男性,,,,0
341,180009,福井県,,2020/12/25,,おおい町,50代,男性,,,,0
342,180009,福井県,,2020/12/25,,小浜市,20代,男性,,,,0
343,180009,福井県,,2020/12/25,2020/12/18,高浜町,30代,男性,,,,0
344,180009,福井県,,2020/12/26,,おおい町,20代,男性,,,,0
345,180009,福井県,,2020/12/26,,敦賀市,30代,男性,,,,0
346,180009,福井県,,2020/12/27,2020/12/23,敦賀市,30代,男性,,,,0
347,180009,福井県,,2020/12/28,2020/12/26,敦賀市,30代,男性,,,,0
348,180009,福井県,,2020/12/28,,敦賀市,40代,女性,,,,0
349,180009,福井県,,2020/12/29,2020/12/27,長野県,30代,男性,,,,0
350,180009,福井県,,2020/12/29,2020/12/27,小浜市,30代,男性,,,,0
351,180009,福井県,,2020/12/30,2020/12/24,敦賀市,30代,男性,,,,0
352,180009,福井県,,2020/12/30,2020/12/24,敦賀市,20代,男性,,,,0
353,180009,福井県,,2020/12/30,2020/12/29,敦賀市,30代,男性,,,,0
354,180009,福井県,,2020/12/31,,敦賀市,30代,男性,,,,0
355,180009,福井県,,2020/12/31,,敦賀市,30代,男性,,,,0
356,180009,福井県,,2021/1/2,,愛知県,20代,男性,,,,0
357,180009,福井県,,2021/1/2,2020/12/28,鯖江市,30代,男性,,,,0
358,180009,福井県,,2021/1/2,2020/12/30,鯖江市,40代,男性,,,,0
359,180009,福井県,,2021/1/2,2020/12/30,北海道,10代,男性,,,,0
360,180009,福井県,,2021/1/4,2021/1/2,坂井市,20代,男性,,,,0
361,180009,福井県,,2021/1/5,2021/1/2,小浜市,20代,男性,,,,0
362,180009,福井県,,2021/1/5,2020/12/29,京都府,30代,男性,,,,0
363,180009,福井県,,2021/1/6,2021/1/1,東京都,30代,男性,,,,0
364,180009,福井県,,2021/1/6,2021/1/3,小浜市,50代,女性,,,,0
365,180009,福井県,,2021/1/6,2021/1/4,小浜市,60代,男性,,,,0
366,180009,福井県,,2021/1/6,2020/12/30,敦賀市,60代,女性,,,,0
367,180009,福井県,,2021/1/6,2021/1/3,小浜市,30代,女性,,,,0
368,180009,福井県,,2021/1/6,2020/12/31,坂井市,50代,女性,,,,0
369,180009,福井県,,2021/1/6,,小浜市,30代,男性,,,,0
370,180009,福井県,,2021/1/6,2021/1/6,小浜市,30代,女性,,,,0
371,180009,福井県,,2021/1/6,,若狭町,80代,男性,,,,0
372,180009,福井県,,2021/1/6,,若狭町,80代,女性,,,,0
373,180009,福井県,,2021/1/6,,若狭町,50代,女性,,,,0
374,180009,福井県,,2021/1/6,,若狭町,50代,男性,,,,0
375,180009,福井県,,2021/1/6,,小浜市,30代,女性,,,,0
376,180009,福井県,,2021/1/6,,小浜市,10歳未満,女性,,,,0
377,180009,福井県,,2021/1/7,,小浜市,50代,男性,,,,0
378,180009,福井県,,2021/1/7,2021/1/1,福井市,30代,男性,,,,0
379,180009,福井県,,2021/1/7,2021/1/4,敦賀市,40代,女性,,,,0
380,180009,福井県,,2021/1/7,,福井市,20代,女性,,,,0
381,180009,福井県,,2021/1/8,,福井市,20代,女性,,,,0
382,180009,福井県,,2021/1/8,2021/1/6,福井市,50代,女性,,,,0
383,180009,福井県,,2021/1/8,,福井市,70代,女性,,,,0
384,180009,福井県,,2021/1/8,2021/1/6,福井市,10代,男性,,,,0
385,180009,福井県,,2021/1/8,,福井市,40代,男性,,,,0
386,180009,福井県,,2021/1/8,2021/1/6,福井市,30代,男性,,,,0
387,180009,福井県,,2021/1/8,2021/1/6,福井市,10歳未満,男性,,,,0
388,180009,福井県,,2021/1/9,2021/1/5,坂井市,20代,女性,,,,0
389,180009,福井県,,2021/1/9,2021/1/7,大阪府,20代,男性,,,,0
390,180009,福井県,,2021/1/9,2021/1/3,福井市,50代,女性,,,,0
391,180009,福井県,,2021/1/9,2021/1/7,北海道,20代,男性,,,,0
392,180009,福井県,,2021/1/9,,坂井市,50代,女性,,,,0
393,180009,福井県,,2021/1/9,,敦賀市,10代,男性,,,,0
394,180009,福井県,,2021/1/9,,敦賀市,10代,女性,,,,0
395,180009,福井県,,2021/1/9,,福井市,50代,男性,,,,0
396,180009,福井県,,2021/1/9,,福井市,50代,女性,,,,0
397,180009,福井県,,2021/1/9,,福井市,40代,男性,,,,0
398,180009,福井県,,2021/1/11,2021/1/6,東京都,40代,男性,,,,0
399,180009,福井県,,2021/1/11,2021/1/5,おおい町,60代,男性,,,,0
400,180009,福井県,,2021/1/13,2021/1/9,鯖江市,50代,女性,,,,0
401,180009,福井県,,2021/1/13,2021/1/9,福井市,20代,男性,,,,0
402,180009,福井県,,2021/1/13,2021/1/7,福井市,20代,男性,,,,0
403,180009,福井県,,2021/1/14,2021/1/7,坂井市,80代,女性,,,,0
404,180009,福井県,,2021/1/14,2021/1/11,坂井市,60代,女性,,,,0
405,180009,福井県,,2021/1/14,,坂井市,70代,男性,,,,0
406,180009,福井県,,2021/1/14,2021/1/12,福井市,40代,男性,,,,0
407,180009,福井県,,2021/1/14,,坂井市,60代,女性,,,,0
408,180009,福井県,,2021/1/14,2021/1/9,坂井市,80代,女性,,,,0
409,180009,福井県,,2021/1/14,,坂井市,80代,女性,,,,0
410,180009,福井県,,2021/1/14,,坂井市,60代,男性,,,,0
411,180009,福井県,,2021/1/14,2021/1/6,敦賀市,20代,男性,,,,0
412,180009,福井県,,2021/1/15,2021/1/13,福井市,40代,男性,,,,0
413,180009,福井県,,2021/1/15,2021/1/10,坂井市,90代,女性,,,,0
414,180009,福井県,,2021/1/15,2021/1/13,坂井市,80代,女性,,,,0
415,180009,福井県,,2021/1/15,2021/1/13,坂井市,90代,女性,,,,0
416,180009,福井県,,2021/1/15,2021/1/9,坂井市,80代,女性,,,,0
417,180009,福井県,,2021/1/15,2021/1/12,坂井市,90代,女性,,,,0
418,180009,福井県,,2021/1/15,2021/1/12,坂井市,80代,男性,,,,0
419,180009,福井県,,2021/1/15,2021/1/9,坂井市,90代,女性,,,,0
420,180009,福井県,,2021/1/15,,坂井市,80代,女性,,,,0
421,180009,福井県,,2021/1/15,2021/1/12,敦賀市,,,,,,0
422,180009,福井県,,2021/1/15,,敦賀市,,,,,,0
423,180009,福井県,,2021/1/15,2021/1/14,福井市,30代,男性,,,,0
424,180009,福井県,,2021/1/15,,坂井市,80代,女性,,,,0
425,180009,福井県,,2021/1/15,,坂井市,90代,女性,,,,0
426,180009,福井県,,2021/1/15,,坂井市,90代,女性,,,,0
427,180009,福井県,,2021/1/15,,坂井市,90代,女性,,,,0
428,180009,福井県,,2021/1/15,2021/1/14,坂井市,90代,女性,,,,0
429,180009,福井県,,2021/1/15,,坂井市,100歳以上,女性,,,,0
430,180009,福井県,,2021/1/15,2021/1/14,坂井市,90代,男性,,,,0
431,180009,福井県,,2021/1/15,,坂井市,80代,女性,,,,0
432,180009,福井県,,2021/1/15,2021/1/14,坂井市,90代,女性,,,,0
433,180009,福井県,,2021/1/15,,坂井市,60代,女性,,,,0
434,180009,福井県,,2021/1/15,,坂井市,40代,女性,,,,0
435,180009,福井県,,2021/1/15,,あわら市,50代,女性,,,,0
436,180009,福井県,,2021/1/15,2021/1/13,福井市,70代,男性,,,,0
437,180009,福井県,,2021/1/16,2021/1/9,越前市,40代,男性,,,,0
438,180009,福井県,,2021/1/16,2021/1/7,福井市,60代,女性,,,,0
439,180009,福井県,,2021/1/16,2021/1/14,坂井市,40代,女性,,,,0
440,180009,福井県,,2021/1/16,2021/1/11,福井市,50代,女性,,,,0
441,180009,福井県,,2021/1/16,2021/1/9,福井市,60代,男性,,,,0
442,180009,福井県,,2021/1/16,2021/1/14,越前市,40代,女性,,,,0
443,180009,福井県,,2021/1/16,,福井市,70代,女性,,,,0
444,180009,福井県,,2021/1/17,2021/1/16,坂井市,80代,女性,,,,0
445,180009,福井県,,2021/1/17,,坂井市,70代,女性,,,,0
446,180009,福井県,,2021/1/17,,福井市,70代,女性,,,,0
447,180009,福井県,,2021/1/17,,福井市,60代,女性,,,,0
448,180009,福井県,,2021/1/18,2021/1/16,福井市,40代,男性,,,,0
449,180009,福井県,,2021/1/18,,福井市,10代,男性,,,,0
450,180009,福井県,,2021/1/18,2021/1/16,永平寺町,20代,女性,,,,0
451,180009,福井県,,2021/1/18,2021/1/17,坂井市,80代,男性,,,,0
452,180009,福井県,,2021/1/18,,あわら市,20代,男性,,,,0
453,180009,福井県,,2021/1/18,,坂井市,20代,男性,,,,0
454,180009,福井県,,2021/1/18,2021/1/15,福井市,80代,男性,,,,0
455,180009,福井県,,2021/1/18,,福井市,40代,女性,,,,0
456,180009,福井県,,2021/1/18,2021/1/18,小浜市,50代,女性,,,,0
457,180009,福井県,,2021/1/19,2021/1/16,福井市,50代,男性,,,,0
458,180009,福井県,,2021/1/19,2021/1/18,福井市,80代,女性,,,,0
459,180009,福井県,,2021/1/19,2021/1/18,坂井市,90代,女性,,,,0
460,180009,福井県,,2021/1/19,,坂井市,70代,女性,,,,0
461,180009,福井県,,2021/1/19,,坂井市,90代,女性,,,,0
462,180009,福井県,,2021/1/20,2021/1/16,福井市,50代,男性,,,,0
463,180009,福井県,,2021/1/21,2021/1/17,あわら市,60代,女性,,,,0
464,180009,福井県,,2021/1/21,2021/1/20,坂井市,80代,男性,,,,0
465,180009,福井県,,2021/1/21,2021/1/20,坂井市,90代,男性,,,,0
466,180009,福井県,,2021/1/21,,坂井市,100歳以上,女性,,,,0
467,180009,福井県,,2021/1/21,2021/1/20,福井市,30代,男性,,,,0
468,180009,福井県,,2021/1/22,2021/1/21,敦賀市,,,,,,0
469,180009,福井県,,2021/1/22,,坂井市,90代,女性,,,,0
470,180009,福井県,,2021/1/22,2021/1/21,坂井市,70代,男性,,,,0
471,180009,福井県,,2021/1/22,2021/1/14,越前市,50代,女性,,,,0
472,180009,福井県,,2021/1/23,2021/1/21,高浜町,30代,女性,,,,0
473,180009,福井県,,2021/1/23,2021/1/21,高浜町,10代,女性,,,,0
474,180009,福井県,,2021/1/23,2021/1/22,坂井市,70代,女性,,,,0
475,180009,福井県,,2021/1/23,,坂井市,70代,女性,,,,0